[Guide] How to Compile the Source

Page 3 of 3 FirstFirst 123
Results 31 to 45 of 45
  1. #31
    RaiderZ Mod cmb is offline
    DeveloperRank
    Mar 2007 Join Date
    859Posts

    Re: [Guide] How to Compile the Source

    Quote Originally Posted by Hycker View Post
    here is the complete log from VS2k8SP1
    Snipped...
    You must not have the SDK downloaded, cause your missing files are all from the SDK. There is a link in the first post of this thread to it.

  2. #32
    Azure subscription Hycker is offline
    SubscriberRank
    Dec 2010 Join Date
    /root/gameguardLocation
    1,444Posts

    Re: [Guide] How to Compile the Source

    typical example to read carefully.... sry for noobish and thanks ya dude
    PW SCAMMERS SKYPE:mendax_mad, alexdevmmo
    im looking for that game: https://www.youtube.com/watch?v=UfB-l7ueyOg
    pick me on skype
    Spoiler:
    hyckerdev

  3. #33
    Azure subscription Hycker is offline
    SubscriberRank
    Dec 2010 Join Date
    /root/gameguardLocation
    1,444Posts

    Re: [Guide] How to Compile the Source

    what did i wrong if i dont see the server in the list? (i mean after login)
    PW SCAMMERS SKYPE:mendax_mad, alexdevmmo
    im looking for that game: https://www.youtube.com/watch?v=UfB-l7ueyOg
    pick me on skype
    Spoiler:
    hyckerdev

  4. #34
    Newbie 0rb3 is offline
    MemberRank
    Feb 2014 Join Date
    4Posts

    sad Re: [Guide] How to Compile the Source

    Hope you guys can help me. Everytime i try to compile the souce i got this error:

    c1xx : fatal error C1027: Inconsistent values for /Ym between creation and use of precompiled header
    XCutSceneGameEntity.cpp
    XCutSceneFieldIntroMgr.cpp
    c1xx : fatal error C1027: Inconsistent values for /Ym between creation and use of precompiled header
    c1xx : fatal error C1027: Inconsistent values for /Ym between creation and use of precompiled header
    XCutSceneController.cpp
    c1xx : fatal error C1027: Inconsistent values for /Ym between creation and use of precompiled header
    XPvPAreaLogic.cpp

    I tried with the option to not use precompile headers but still is showing. I am using MS visual studio 2008 SP1 with korean locate btw.

  5. #35
    Registered NoNam3 is offline
    MemberRank
    May 2014 Join Date
    11Posts

    Re: [Guide] How to Compile the Source

    Hello, I compiled the client and server binaries without any issues but I have a few questions to clear some things out.
    This source for the server and client are the alpha version or what?
    Are there anywhere the exact client files we need for this client version? (same for server side)

    How exactly do I config the client to connect to my server?

    Thank you!

  6. #36
    Newbie vikisangre is offline
    MemberRank
    Jul 2015 Join Date
    India/PunjabLocation
    1Posts

    Re: [Guide] How to Compile the Source

    Thanks for post in such a detail.

  7. #37
    RaiderZ Coder Jose Lucas is offline
    True MemberRank
    Jun 2013 Join Date
    IngenLocation
    243Posts

    Re: [Guide] How to Compile the Source

    Quote Originally Posted by NoNam3 View Post
    Hello, I compiled the client and server binaries without any issues but I have a few questions to clear some things out.
    This source for the server and client are the alpha version or what?
    Are there anywhere the exact client files we need for this client version? (same for server side)

    How exactly do I config the client to connect to my server?

    Thank you!
    Its the Alpha Version
    Client:
    https://mega.co.nz/#!V14R0LgZ!Pg6-yA...nerSYuf4B6vnEs




  8. #38
    Newbie ALbino Lopes is offline
    MemberRank
    Oct 2015 Join Date
    2Posts

    Re: [Guide] How to Compile the Source

    can some1 reupload?

  9. #39
    Member kiko87 is offline
    MemberRank
    Oct 2015 Join Date
    under a bridgeLocation
    33Posts

    Re: [Guide] How to Compile the Source

    Quote Originally Posted by bloodforevil View Post


    all methods did

    but the result is always the same
    to fix this problem go in \Develop\Game\App end create 1 file SVNRevision.h whit tha code
    is tha same code from Develop/Game.

    Code:
    #pragma once
    
    #define SVN_REVISION "28451"
    #define SVN_DATE "2011-05-30 ¿ÀÈÄ 11:54:46"

  10. #40
    Newbie Albedaia is offline
    MemberRank
    Dec 2011 Join Date
    4Posts

    Re: [Guide] How to Compile the Source

    hi
    i have problems when i compile source code
    Code:
    1>------ Build started: Project: cml2, Configuration: Release Win32 ------
    2>------ Build started: Project: MCollision, Configuration: Release Win32 ------
    3>------ Build started: Project: crl, Configuration: Release Win32 ------
    4>------ Build started: Project: MiNet, Configuration: Release Win32 ------
    5>------ Build started: Project: MPathFinder, Configuration: Release Win32 ------
    6>------ Build started: Project: MTest, Configuration: Release Win32 ------
    2>  stdafx.cpp
    3>  stdafx.cpp
    4>  stdafx.cpp
    5>  MPathFinder.cpp
    5>  MPathTerrainCallback.cpp
    2>e:\raiderz\sourcecode\trunk\develop\mdk\cml2\MVector3.h(327): warning C4244: 'return': conversion from 'double' to 'float', possible loss of data
    2>e:\raiderz\sourcecode\trunk\develop\mdk\cml2\MVector3.h(329): warning C4244: 'return': conversion from 'double' to 'float', possible loss of data
    2>e:\raiderz\sourcecode\trunk\develop\mdk\cml2\MPlane.h(126): warning C4244: '=': conversion from 'double' to 'float', possible loss of data
    1>  MArchive.cpp
    2>e:\raiderz\sourcecode\trunk\develop\mdk\cml2\MPlane.h(127): warning C4244: '=': conversion from 'double' to 'float', possible loss of data
    1>  MBox.cpp
    1>  MCapsule.cpp
    1>  MConvexHullAlgorithm.cpp
    1>  MDebug.cpp
    1>  MFileBuffer.cpp
    6>  MAutoTestRunner.cpp
    2>e:\raiderz\sourcecode\trunk\develop\mdk\cml2\MBox.h(323): error C2059: syntax error: '('
    2>e:\raiderz\sourcecode\trunk\develop\mdk\cml2\MBox.h(323): error C2059: syntax error: 'constant'
    2>e:\raiderz\sourcecode\trunk\develop\mdk\cml2\MBox.h(323): error C2091: function returns function
    2>e:\raiderz\sourcecode\trunk\develop\mdk\cml2\MBox.h(323): error C2535: 'MBox::MBox(void)': member function already defined or declared
    2>  e:\raiderz\sourcecode\trunk\develop\mdk\cml2\MBox.h(27): note: see declaration of 'MBox::MBox'
    2>e:\raiderz\sourcecode\trunk\develop\mdk\cml2\MBox.h(323): error C2059: syntax error: ')'
    2>e:\raiderz\sourcecode\trunk\develop\mdk\cml2\MBox.h(293): error C3861: 'max': identifier not found
    2>e:\raiderz\sourcecode\trunk\develop\mdk\cml2\MBox.h(294): error C3861: 'min': identifier not found
    6>e:\raiderz\sourcecode\trunk\develop\mdk\cml2\MBox.h(323): error C2059: syntax error: '('
    6>e:\raiderz\sourcecode\trunk\develop\mdk\cml2\MBox.h(323): error C2059: syntax error: 'constant'
    6>e:\raiderz\sourcecode\trunk\develop\mdk\cml2\MBox.h(323): error C2091: function returns function
    6>e:\raiderz\sourcecode\trunk\develop\mdk\cml2\MBox.h(323): error C2535: 'MBox::MBox(void)': member function already defined or declared
    6>  e:\raiderz\sourcecode\trunk\develop\mdk\cml2\MBox.h(27): note: see declaration of 'MBox::MBox'
    6>e:\raiderz\sourcecode\trunk\develop\mdk\cml2\MBox.h(323): error C2059: syntax error: ')'
    3>e:\raiderz\sourcecode\trunk\develop\mdk\cml2\MBox.h(323): error C2059: syntax error: '('
    3>e:\raiderz\sourcecode\trunk\develop\mdk\cml2\MBox.h(323): error C2059: syntax error: 'constant'
    3>e:\raiderz\sourcecode\trunk\develop\mdk\cml2\MBox.h(323): error C2091: function returns function
    3>e:\raiderz\sourcecode\trunk\develop\mdk\cml2\MBox.h(323): error C2535: 'MBox::MBox(void)': member function already defined or declared
    3>  e:\raiderz\sourcecode\trunk\develop\mdk\cml2\MBox.h(27): note: see declaration of 'MBox::MBox'
    3>e:\raiderz\sourcecode\trunk\develop\mdk\cml2\MBox.h(323): error C2059: syntax error: ')'
    4>e:\raiderz\sourcecode\trunk\develop\mdk\cml2\MBox.h(323): error C2059: syntax error: '('
    4>e:\raiderz\sourcecode\trunk\develop\mdk\cml2\MBox.h(323): error C2059: syntax error: 'constant'
    4>e:\raiderz\sourcecode\trunk\develop\mdk\cml2\MBox.h(323): error C2091: function returns function
    4>e:\raiderz\sourcecode\trunk\develop\mdk\cml2\MBox.h(323): error C2535: 'MBox::MBox(void)': member function already defined or declared
    4>  e:\raiderz\sourcecode\trunk\develop\mdk\cml2\MBox.h(27): note: see declaration of 'MBox::MBox'
    4>e:\raiderz\sourcecode\trunk\develop\mdk\cml2\MBox.h(323): error C2059: syntax error: ')'
    5>e:\raiderz\sourcecode\trunk\develop\mdk\cml2\MBox.h(323): error C2059: syntax error: '(' (compiling source file MPathTerrainCallback.cpp)
    1>e:\raiderz\sourcecode\trunk\develop\mdk\cml2\MBox.h(323): error C2059: syntax error: '(' (compiling source file MCapsule.cpp)
    5>e:\raiderz\sourcecode\trunk\develop\mdk\cml2\MBox.h(323): error C2059: syntax error: 'constant' (compiling source file MPathTerrainCallback.cpp)
    5>e:\raiderz\sourcecode\trunk\develop\mdk\cml2\MBox.h(323): error C2091: function returns function (compiling source file MPathTerrainCallback.cpp)
    5>e:\raiderz\sourcecode\trunk\develop\mdk\cml2\MBox.h(323): error C2535: 'MBox::MBox(void)': member function already defined or declared (compiling source file MPathTerrainCallback.cpp)
    5>  e:\raiderz\sourcecode\trunk\develop\mdk\cml2\MBox.h(27): note: see declaration of 'MBox::MBox' (compiling source file MPathTerrainCallback.cpp)
    5>e:\raiderz\sourcecode\trunk\develop\mdk\cml2\MBox.h(323): error C2059: syntax error: ')' (compiling source file MPathTerrainCallback.cpp)
    1>e:\raiderz\sourcecode\trunk\develop\mdk\cml2\MBox.h(323): error C2059: syntax error: 'constant' (compiling source file MCapsule.cpp)
    1>e:\raiderz\sourcecode\trunk\develop\mdk\cml2\MBox.h(323): error C2091: function returns function (compiling source file MCapsule.cpp)
    1>e:\raiderz\sourcecode\trunk\develop\mdk\cml2\MBox.h(323): error C2535: 'MBox::MBox(void)': member function already defined or declared (compiling source file MCapsule.cpp)
    1>  e:\raiderz\sourcecode\trunk\develop\mdk\cml2\MBox.h(27): note: see declaration of 'MBox::MBox' (compiling source file MCapsule.cpp)
    1>e:\raiderz\sourcecode\trunk\develop\mdk\cml2\MBox.h(323): error C2059: syntax error: ')' (compiling source file MCapsule.cpp)
    7>------ Build started: Project: CSCommon, Configuration: ReleaseW Win32 ------
    1>e:\raiderz\sourcecode\trunk\develop\mdk\cml2\MBox.h(323): error C2059: syntax error: '(' (compiling source file MArchive.cpp)
    1>e:\raiderz\sourcecode\trunk\develop\mdk\cml2\MBox.h(323): error C2059: syntax error: 'constant' (compiling source file MArchive.cpp)
    1>e:\raiderz\sourcecode\trunk\develop\mdk\cml2\MBox.h(323): error C2091: function returns function (compiling source file MArchive.cpp)
    1>e:\raiderz\sourcecode\trunk\develop\mdk\cml2\MBox.h(323): error C2535: 'MBox::MBox(void)': member function already defined or declared (compiling source file MArchive.cpp)
    1>  e:\raiderz\sourcecode\trunk\develop\mdk\cml2\MBox.h(27): note: see declaration of 'MBox::MBox' (compiling source file MArchive.cpp)
    1>e:\raiderz\sourcecode\trunk\develop\mdk\cml2\MBox.h(323): error C2059: syntax error: ')' (compiling source file MArchive.cpp)
    1>e:\raiderz\sourcecode\trunk\develop\mdk\cml2\MBox.h(323): error C2059: syntax error: '(' (compiling source file MFileBuffer.cpp)
    1>e:\raiderz\sourcecode\trunk\develop\mdk\cml2\MBox.h(323): error C2059: syntax error: 'constant' (compiling source file MFileBuffer.cpp)
    1>e:\raiderz\sourcecode\trunk\develop\mdk\cml2\MBox.h(323): error C2091: function returns function (compiling source file MFileBuffer.cpp)
    1>e:\raiderz\sourcecode\trunk\develop\mdk\cml2\MBox.h(323): error C2535: 'MBox::MBox(void)': member function already defined or declared (compiling source file MFileBuffer.cpp)
    1>  e:\raiderz\sourcecode\trunk\develop\mdk\cml2\MBox.h(27): note: see declaration of 'MBox::MBox' (compiling source file MFileBuffer.cpp)
    1>e:\raiderz\sourcecode\trunk\develop\mdk\cml2\MBox.h(323): error C2059: syntax error: ')' (compiling source file MFileBuffer.cpp)
    1>e:\raiderz\sourcecode\trunk\develop\mdk\cml2\MBox.h(323): error C2059: syntax error: '(' (compiling source file MBox.cpp)
    1>e:\raiderz\sourcecode\trunk\develop\mdk\cml2\MBox.h(323): error C2059: syntax error: 'constant' (compiling source file MBox.cpp)
    1>e:\raiderz\sourcecode\trunk\develop\mdk\cml2\MBox.h(323): error C2091: function returns function (compiling source file MBox.cpp)
    1>e:\raiderz\sourcecode\trunk\develop\mdk\cml2\MBox.h(323): error C2535: 'MBox::MBox(void)': member function already defined or declared (compiling source file MBox.cpp)
    1>  e:\raiderz\sourcecode\trunk\develop\mdk\cml2\MBox.h(27): note: see declaration of 'MBox::MBox' (compiling source file MBox.cpp)
    1>e:\raiderz\sourcecode\trunk\develop\mdk\cml2\MBox.h(323): error C2059: syntax error: ')' (compiling source file MBox.cpp)
    1>e:\raiderz\sourcecode\trunk\develop\mdk\cml2\MBox.h(323): error C2059: syntax error: '(' (compiling source file MConvexHullAlgorithm.cpp)
    5>e:\raiderz\sourcecode\trunk\develop\mdk\cml2\MBox.h(323): error C2059: syntax error: '(' (compiling source file MPathFinder.cpp)
    1>e:\raiderz\sourcecode\trunk\develop\mdk\cml2\MBox.h(323): error C2059: syntax error: 'constant' (compiling source file MConvexHullAlgorithm.cpp)
    1>e:\raiderz\sourcecode\trunk\develop\mdk\cml2\MBox.h(323): error C2091: function returns function (compiling source file MConvexHullAlgorithm.cpp)
    1>e:\raiderz\sourcecode\trunk\develop\mdk\cml2\MBox.h(323): error C2535: 'MBox::MBox(void)': member function already defined or declared (compiling source file MConvexHullAlgorithm.cpp)
    5>e:\raiderz\sourcecode\trunk\develop\mdk\cml2\MBox.h(323): error C2059: syntax error: 'constant' (compiling source file MPathFinder.cpp)
    1>  e:\raiderz\sourcecode\trunk\develop\mdk\cml2\MBox.h(27): note: see declaration of 'MBox::MBox' (compiling source file MConvexHullAlgorithm.cpp)
    1>e:\raiderz\sourcecode\trunk\develop\mdk\cml2\MBox.h(323): error C2059: syntax error: ')' (compiling source file MConvexHullAlgorithm.cpp)
    5>e:\raiderz\sourcecode\trunk\develop\mdk\cml2\MBox.h(323): error C2091: function returns function (compiling source file MPathFinder.cpp)
    5>e:\raiderz\sourcecode\trunk\develop\mdk\cml2\MBox.h(323): error C2535: 'MBox::MBox(void)': member function already defined or declared (compiling source file MPathFinder.cpp)
    5>  e:\raiderz\sourcecode\trunk\develop\mdk\cml2\MBox.h(27): note: see declaration of 'MBox::MBox' (compiling source file MPathFinder.cpp)
    5>e:\raiderz\sourcecode\trunk\develop\mdk\cml2\MBox.h(323): error C2059: syntax error: ')' (compiling source file MPathFinder.cpp)
    1>  MIOCP.cpp
    1>MBox.cpp(4): error C2589: '(': illegal token on right side of '::'
    1>MBox.cpp(4): error C2143: syntax error: missing ';' before '::'
    1>MBox.cpp(4): error C2059: syntax error: '::'
    1>  MMath.cpp
    1>  MOBox.cpp
    7>  stdafx.cpp
    1>  MPageArray.cpp
    1>e:\raiderz\sourcecode\trunk\develop\mdk\cml2\MPageArray.h(33): error C2065: 'greater': undeclared identifier (compiling source file MPageArray.cpp)
    1>  e:\raiderz\sourcecode\trunk\develop\mdk\cml2\MPageArray.h(126): note: see reference to class template instantiation 'MPageArray<T>' being compiled (compiling source file MPageArray.cpp)
    1>e:\raiderz\sourcecode\trunk\develop\mdk\cml2\MPageArray.h(33): error C2062: type 'int' unexpected (compiling source file MPageArray.cpp)
    1>e:\raiderz\sourcecode\trunk\develop\mdk\cml2\MPageArray.h(33): error C2059: syntax error: '>' (compiling source file MPageArray.cpp)
    1>e:\raiderz\sourcecode\trunk\develop\mdk\cml2\MPageArray.h(33): error C2238: unexpected token(s) preceding ';' (compiling source file MPageArray.cpp)
    1>MDebug.cpp(60): error C3680: cannot concatenate user-defined string literals with mismatched literal suffix identifiers
    1>  MDebug.cpp(60): note: Concatenating suffix '__DATE__' with suffix '__TIME__'
    1>MDebug.cpp(60): error C3688: invalid literal suffix '__DATE__'; literal operator or literal operator template 'operator ""__DATE__' not found
    1>  MProfiler.cpp
    1>  MSphere.cpp
    1>  MStatisticsProfiler.cpp
    1>e:\raiderz\sourcecode\trunk\develop\mdk\cml2\MBox.h(323): error C2059: syntax error: '(' (compiling source file MIOCP.cpp)
    1>e:\raiderz\sourcecode\trunk\develop\mdk\cml2\MBox.h(323): error C2059: syntax error: 'constant' (compiling source file MIOCP.cpp)
    1>e:\raiderz\sourcecode\trunk\develop\mdk\cml2\MBox.h(323): error C2091: function returns function (compiling source file MIOCP.cpp)
    1>e:\raiderz\sourcecode\trunk\develop\mdk\cml2\MBox.h(323): error C2535: 'MBox::MBox(void)': member function already defined or declared (compiling source file MIOCP.cpp)
    1>  e:\raiderz\sourcecode\trunk\develop\mdk\cml2\MBox.h(27): note: see declaration of 'MBox::MBox' (compiling source file MIOCP.cpp)
    1>e:\raiderz\sourcecode\trunk\develop\mdk\cml2\MBox.h(323): error C2059: syntax error: ')' (compiling source file MIOCP.cpp)
    1>e:\raiderz\sourcecode\trunk\develop\mdk\cml2\MBox.h(323): error C2059: syntax error: '(' (compiling source file MMath.cpp)
    1>e:\raiderz\sourcecode\trunk\develop\mdk\cml2\MBox.h(323): error C2059: syntax error: 'constant' (compiling source file MMath.cpp)
    1>e:\raiderz\sourcecode\trunk\develop\mdk\cml2\MBox.h(323): error C2091: function returns function (compiling source file MMath.cpp)
    1>e:\raiderz\sourcecode\trunk\develop\mdk\cml2\MBox.h(323): error C2535: 'MBox::MBox(void)': member function already defined or declared (compiling source file MMath.cpp)
    1>  e:\raiderz\sourcecode\trunk\develop\mdk\cml2\MBox.h(27): note: see declaration of 'MBox::MBox' (compiling source file MMath.cpp)
    1>e:\raiderz\sourcecode\trunk\develop\mdk\cml2\MBox.h(323): error C2059: syntax error: ')' (compiling source file MMath.cpp)
    1>e:\raiderz\sourcecode\trunk\develop\mdk\cml2\MBox.h(323): error C2059: syntax error: '(' (compiling source file MOBox.cpp)
    1>e:\raiderz\sourcecode\trunk\develop\mdk\cml2\MBox.h(323): error C2059: syntax error: 'constant' (compiling source file MOBox.cpp)
    1>e:\raiderz\sourcecode\trunk\develop\mdk\cml2\MBox.h(323): error C2091: function returns function (compiling source file MOBox.cpp)
    1>e:\raiderz\sourcecode\trunk\develop\mdk\cml2\MBox.h(323): error C2535: 'MBox::MBox(void)': member function already defined or declared (compiling source file MOBox.cpp)
    1>  e:\raiderz\sourcecode\trunk\develop\mdk\cml2\MBox.h(27): note: see declaration of 'MBox::MBox' (compiling source file MOBox.cpp)
    1>e:\raiderz\sourcecode\trunk\develop\mdk\cml2\MBox.h(323): error C2059: syntax error: ')' (compiling source file MOBox.cpp)
    1>  MUID.cpp
    1>  MUtil.cpp
    1>  MVector3.cpp
    1>e:\raiderz\sourcecode\trunk\develop\mdk\cml2\MBox.h(323): error C2059: syntax error: '(' (compiling source file MSphere.cpp)
    1>e:\raiderz\sourcecode\trunk\develop\mdk\cml2\MBox.h(323): error C2059: syntax error: 'constant' (compiling source file MSphere.cpp)
    1>e:\raiderz\sourcecode\trunk\develop\mdk\cml2\MBox.h(323): error C2091: function returns function (compiling source file MSphere.cpp)
    1>e:\raiderz\sourcecode\trunk\develop\mdk\cml2\MBox.h(323): error C2535: 'MBox::MBox(void)': member function already defined or declared (compiling source file MSphere.cpp)
    1>  e:\raiderz\sourcecode\trunk\develop\mdk\cml2\MBox.h(27): note: see declaration of 'MBox::MBox' (compiling source file MSphere.cpp)
    1>e:\raiderz\sourcecode\trunk\develop\mdk\cml2\MBox.h(323): error C2059: syntax error: ')' (compiling source file MSphere.cpp)
    7>e:\raiderz\sourcecode\trunk\develop\mdk\cml2\MBox.h(323): error C2059: syntax error: '('
    7>e:\raiderz\sourcecode\trunk\develop\mdk\cml2\MBox.h(323): error C2059: syntax error: 'constant'
    7>e:\raiderz\sourcecode\trunk\develop\mdk\cml2\MBox.h(323): error C2091: function returns function
    7>e:\raiderz\sourcecode\trunk\develop\mdk\cml2\MBox.h(323): error C2535: 'MBox::MBox(void)': member function already defined or declared
    7>  e:\raiderz\sourcecode\trunk\develop\mdk\cml2\MBox.h(27): note: see declaration of 'MBox::MBox'
    7>e:\raiderz\sourcecode\trunk\develop\mdk\cml2\MBox.h(323): error C2059: syntax error: ')'
    1>e:\raiderz\sourcecode\trunk\develop\mdk\cml2\MBox.h(323): error C2059: syntax error: '(' (compiling source file MProfiler.cpp)
    1>e:\raiderz\sourcecode\trunk\develop\mdk\cml2\MBox.h(323): error C2059: syntax error: 'constant' (compiling source file MProfiler.cpp)
    1>e:\raiderz\sourcecode\trunk\develop\mdk\cml2\MBox.h(323): error C2091: function returns function (compiling source file MProfiler.cpp)
    1>e:\raiderz\sourcecode\trunk\develop\mdk\cml2\MBox.h(323): error C2535: 'MBox::MBox(void)': member function already defined or declared (compiling source file MProfiler.cpp)
    1>  e:\raiderz\sourcecode\trunk\develop\mdk\cml2\MBox.h(27): note: see declaration of 'MBox::MBox' (compiling source file MProfiler.cpp)
    1>e:\raiderz\sourcecode\trunk\develop\mdk\cml2\MBox.h(323): error C2059: syntax error: ')' (compiling source file MProfiler.cpp)
    1>e:\raiderz\sourcecode\trunk\develop\mdk\cml2\MBox.h(323): error C2059: syntax error: '(' (compiling source file MStatisticsProfiler.cpp)
    1>e:\raiderz\sourcecode\trunk\develop\mdk\cml2\MBox.h(323): error C2059: syntax error: 'constant' (compiling source file MStatisticsProfiler.cpp)
    1>e:\raiderz\sourcecode\trunk\develop\mdk\cml2\MBox.h(323): error C2091: function returns function (compiling source file MStatisticsProfiler.cpp)
    1>e:\raiderz\sourcecode\trunk\develop\mdk\cml2\MBox.h(323): error C2535: 'MBox::MBox(void)': member function already defined or declared (compiling source file MStatisticsProfiler.cpp)
    1>  e:\raiderz\sourcecode\trunk\develop\mdk\cml2\MBox.h(27): note: see declaration of 'MBox::MBox' (compiling source file MStatisticsProfiler.cpp)
    1>e:\raiderz\sourcecode\trunk\develop\mdk\cml2\MBox.h(323): error C2059: syntax error: ')' (compiling source file MStatisticsProfiler.cpp)
    1>e:\raiderz\sourcecode\trunk\develop\mdk\cml2\MBox.h(323): error C2059: syntax error: '(' (compiling source file MUID.cpp)
    1>e:\raiderz\sourcecode\trunk\develop\mdk\cml2\MBox.h(323): error C2059: syntax error: 'constant' (compiling source file MUID.cpp)
    1>e:\raiderz\sourcecode\trunk\develop\mdk\cml2\MBox.h(323): error C2091: function returns function (compiling source file MUID.cpp)
    1>e:\raiderz\sourcecode\trunk\develop\mdk\cml2\MBox.h(323): error C2535: 'MBox::MBox(void)': member function already defined or declared (compiling source file MUID.cpp)
    1>  e:\raiderz\sourcecode\trunk\develop\mdk\cml2\MBox.h(27): note: see declaration of 'MBox::MBox' (compiling source file MUID.cpp)
    1>e:\raiderz\sourcecode\trunk\develop\mdk\cml2\MBox.h(323): error C2059: syntax error: ')' (compiling source file MUID.cpp)
    1>e:\raiderz\sourcecode\trunk\develop\mdk\cml2\MBox.h(323): error C2059: syntax error: '(' (compiling source file MUtil.cpp)
    1>e:\raiderz\sourcecode\trunk\develop\mdk\cml2\MBox.h(323): error C2059: syntax error: 'constant' (compiling source file MUtil.cpp)
    1>e:\raiderz\sourcecode\trunk\develop\mdk\cml2\MBox.h(323): error C2091: function returns function (compiling source file MUtil.cpp)
    1>e:\raiderz\sourcecode\trunk\develop\mdk\cml2\MBox.h(323): error C2535: 'MBox::MBox(void)': member function already defined or declared (compiling source file MUtil.cpp)
    1>  e:\raiderz\sourcecode\trunk\develop\mdk\cml2\MBox.h(27): note: see declaration of 'MBox::MBox' (compiling source file MUtil.cpp)
    1>e:\raiderz\sourcecode\trunk\develop\mdk\cml2\MBox.h(323): error C2059: syntax error: ')' (compiling source file MUtil.cpp)
    1>e:\raiderz\sourcecode\trunk\develop\mdk\cml2\MBox.h(323): error C2059: syntax error: '(' (compiling source file MVector3.cpp)
    1>e:\raiderz\sourcecode\trunk\develop\mdk\cml2\MBox.h(323): error C2059: syntax error: 'constant' (compiling source file MVector3.cpp)
    1>e:\raiderz\sourcecode\trunk\develop\mdk\cml2\MBox.h(323): error C2091: function returns function (compiling source file MVector3.cpp)
    1>e:\raiderz\sourcecode\trunk\develop\mdk\cml2\MBox.h(323): error C2535: 'MBox::MBox(void)': member function already defined or declared (compiling source file MVector3.cpp)
    1>  e:\raiderz\sourcecode\trunk\develop\mdk\cml2\MBox.h(27): note: see declaration of 'MBox::MBox' (compiling source file MVector3.cpp)
    1>e:\raiderz\sourcecode\trunk\develop\mdk\cml2\MBox.h(323): error C2059: syntax error: ')' (compiling source file MVector3.cpp)
    8>------ Build started: Project: RealSpace3, Configuration: Release Win32 ------
    9>------ Build started: Project: MPhysX, Configuration: Release Win32 ------
    9>  stdafx.cpp
    8>  stdafx.cpp
    8>C:\Program Files (x86)\Microsoft Visual Studio 14.0\VC\include\hash_map(17): error C2338: <hash_map> is deprecated and will be REMOVED. Please use <unordered_map>. You can define _SILENCE_STDEXT_HASH_DEPRECATION_WARNINGS to acknowledge that you have received this warning.
    9>e:\raiderz\sourcecode\trunk\develop\mdk\cml2\MBox.h(323): error C2059: syntax error: '('
    9>e:\raiderz\sourcecode\trunk\develop\mdk\cml2\MBox.h(323): error C2059: syntax error: 'constant'
    9>e:\raiderz\sourcecode\trunk\develop\mdk\cml2\MBox.h(323): error C2091: function returns function
    9>e:\raiderz\sourcecode\trunk\develop\mdk\cml2\MBox.h(323): error C2535: 'MBox::MBox(void)': member function already defined or declared
    9>  e:\raiderz\sourcecode\trunk\develop\mdk\cml2\MBox.h(27): note: see declaration of 'MBox::MBox'
    9>e:\raiderz\sourcecode\trunk\develop\mdk\cml2\MBox.h(323): error C2059: syntax error: ')'
    8>e:\raiderz\sourcecode\trunk\develop\mdk\cml2\MBox.h(323): error C2059: syntax error: '('
    8>e:\raiderz\sourcecode\trunk\develop\mdk\cml2\MBox.h(323): error C2059: syntax error: 'constant'
    8>e:\raiderz\sourcecode\trunk\develop\mdk\cml2\MBox.h(323): error C2091: function returns function
    8>e:\raiderz\sourcecode\trunk\develop\mdk\cml2\MBox.h(323): error C2535: 'MBox::MBox(void)': member function already defined or declared
    8>  e:\raiderz\sourcecode\trunk\develop\mdk\cml2\MBox.h(27): note: see declaration of 'MBox::MBox'
    8>e:\raiderz\sourcecode\trunk\develop\mdk\cml2\MBox.h(323): error C2059: syntax error: ')'
    10>------ Build started: Project: MPhysX4R3, Configuration: Release Win32 ------
    11>------ Build started: Project: GameCommon, Configuration: Release_W Win32 ------
    11>  stdafx.cpp
    10>  MPhysX4R3.cpp
    10>  MPxAniLookUpTC.cpp
    10>  MPxAttacherTC.cpp
    10>  MPxDynamicActorNodeTC.cpp
    10>  MPxDynamicCollisionTC.cpp
    10>  MPxDynamicObjectEntity.cpp
    11>e:\raiderz\sourcecode\trunk\develop\mdk\cml2\MBox.h(323): error C2059: syntax error: '('
    11>e:\raiderz\sourcecode\trunk\develop\mdk\cml2\MBox.h(323): error C2059: syntax error: 'constant'
    11>e:\raiderz\sourcecode\trunk\develop\mdk\cml2\MBox.h(323): error C2091: function returns function
    11>e:\raiderz\sourcecode\trunk\develop\mdk\cml2\MBox.h(323): error C2535: 'MBox::MBox(void)': member function already defined or declared
    11>  e:\raiderz\sourcecode\trunk\develop\mdk\cml2\MBox.h(27): note: see declaration of 'MBox::MBox'
    11>e:\raiderz\sourcecode\trunk\develop\mdk\cml2\MBox.h(323): error C2059: syntax error: ')'
    10>e:\raiderz\sourcecode\trunk\develop\mdk\cml2\MBox.h(323): error C2059: syntax error: '(' (compiling source file MPxDynamicObjectEntity.cpp)
    10>e:\raiderz\sourcecode\trunk\develop\mdk\cml2\MBox.h(323): error C2059: syntax error: 'constant' (compiling source file MPxDynamicObjectEntity.cpp)
    10>e:\raiderz\sourcecode\trunk\develop\mdk\cml2\MBox.h(323): error C2091: function returns function (compiling source file MPxDynamicObjectEntity.cpp)
    10>e:\raiderz\sourcecode\trunk\develop\mdk\cml2\MBox.h(323): error C2535: 'MBox::MBox(void)': member function already defined or declared (compiling source file MPxDynamicObjectEntity.cpp)
    10>  e:\raiderz\sourcecode\trunk\develop\mdk\cml2\MBox.h(27): note: see declaration of 'MBox::MBox' (compiling source file MPxDynamicObjectEntity.cpp)
    10>e:\raiderz\sourcecode\trunk\develop\mdk\cml2\MBox.h(323): error C2059: syntax error: ')' (compiling source file MPxDynamicObjectEntity.cpp)
    10>e:\raiderz\sourcecode\trunk\develop\mdk\cml2\MBox.h(323): error C2059: syntax error: '(' (compiling source file MPhysX4R3.cpp)
    10>e:\raiderz\sourcecode\trunk\develop\mdk\cml2\MBox.h(323): error C2059: syntax error: 'constant' (compiling source file MPhysX4R3.cpp)
    10>e:\raiderz\sourcecode\trunk\develop\mdk\cml2\MBox.h(323): error C2091: function returns function (compiling source file MPhysX4R3.cpp)
    10>e:\raiderz\sourcecode\trunk\develop\mdk\cml2\MBox.h(323): error C2535: 'MBox::MBox(void)': member function already defined or declared (compiling source file MPhysX4R3.cpp)
    10>  e:\raiderz\sourcecode\trunk\develop\mdk\cml2\MBox.h(27): note: see declaration of 'MBox::MBox' (compiling source file MPhysX4R3.cpp)
    10>e:\raiderz\sourcecode\trunk\develop\mdk\cml2\MBox.h(323): error C2059: syntax error: ')' (compiling source file MPhysX4R3.cpp)
    10>e:\raiderz\sourcecode\trunk\develop\mdk\cml2\MBox.h(323): error C2059: syntax error: '(' (compiling source file MPxAniLookUpTC.cpp)
    10>e:\raiderz\sourcecode\trunk\develop\mdk\cml2\MBox.h(323): error C2059: syntax error: 'constant' (compiling source file MPxAniLookUpTC.cpp)
    10>e:\raiderz\sourcecode\trunk\develop\mdk\cml2\MBox.h(323): error C2091: function returns function (compiling source file MPxAniLookUpTC.cpp)
    10>e:\raiderz\sourcecode\trunk\develop\mdk\cml2\MBox.h(323): error C2535: 'MBox::MBox(void)': member function already defined or declared (compiling source file MPxAniLookUpTC.cpp)
    10>  e:\raiderz\sourcecode\trunk\develop\mdk\cml2\MBox.h(27): note: see declaration of 'MBox::MBox' (compiling source file MPxAniLookUpTC.cpp)
    10>e:\raiderz\sourcecode\trunk\develop\mdk\cml2\MBox.h(323): error C2059: syntax error: ')' (compiling source file MPxAniLookUpTC.cpp)
    10>e:\raiderz\sourcecode\trunk\develop\mdk\cml2\MBox.h(323): error C2059: syntax error: '(' (compiling source file MPxDynamicActorNodeTC.cpp)
    10>e:\raiderz\sourcecode\trunk\develop\mdk\cml2\MBox.h(323): error C2059: syntax error: 'constant' (compiling source file MPxDynamicActorNodeTC.cpp)
    10>e:\raiderz\sourcecode\trunk\develop\mdk\cml2\MBox.h(323): error C2091: function returns function (compiling source file MPxDynamicActorNodeTC.cpp)
    10>e:\raiderz\sourcecode\trunk\develop\mdk\cml2\MBox.h(323): error C2535: 'MBox::MBox(void)': member function already defined or declared (compiling source file MPxDynamicActorNodeTC.cpp)
    10>  e:\raiderz\sourcecode\trunk\develop\mdk\cml2\MBox.h(27): note: see declaration of 'MBox::MBox' (compiling source file MPxDynamicActorNodeTC.cpp)
    10>e:\raiderz\sourcecode\trunk\develop\mdk\cml2\MBox.h(323): error C2059: syntax error: ')' (compiling source file MPxDynamicActorNodeTC.cpp)
    10>e:\raiderz\sourcecode\trunk\develop\mdk\cml2\MBox.h(323): error C2059: syntax error: '(' (compiling source file MPxAttacherTC.cpp)
    10>e:\raiderz\sourcecode\trunk\develop\mdk\cml2\MBox.h(323): error C2059: syntax error: 'constant' (compiling source file MPxAttacherTC.cpp)
    10>e:\raiderz\sourcecode\trunk\develop\mdk\cml2\MBox.h(323): error C2091: function returns function (compiling source file MPxAttacherTC.cpp)
    10>e:\raiderz\sourcecode\trunk\develop\mdk\cml2\MBox.h(323): error C2535: 'MBox::MBox(void)': member function already defined or declared (compiling source file MPxAttacherTC.cpp)
    10>  e:\raiderz\sourcecode\trunk\develop\mdk\cml2\MBox.h(27): note: see declaration of 'MBox::MBox' (compiling source file MPxAttacherTC.cpp)
    10>e:\raiderz\sourcecode\trunk\develop\mdk\cml2\MBox.h(323): error C2059: syntax error: ')' (compiling source file MPxAttacherTC.cpp)
    10>e:\raiderz\sourcecode\trunk\develop\mdk\cml2\MBox.h(323): error C2059: syntax error: '(' (compiling source file MPxDynamicCollisionTC.cpp)
    10>e:\raiderz\sourcecode\trunk\develop\mdk\cml2\MBox.h(323): error C2059: syntax error: 'constant' (compiling source file MPxDynamicCollisionTC.cpp)
    10>e:\raiderz\sourcecode\trunk\develop\mdk\cml2\MBox.h(323): error C2091: function returns function (compiling source file MPxDynamicCollisionTC.cpp)
    10>e:\raiderz\sourcecode\trunk\develop\mdk\cml2\MBox.h(323): error C2535: 'MBox::MBox(void)': member function already defined or declared (compiling source file MPxDynamicCollisionTC.cpp)
    10>  e:\raiderz\sourcecode\trunk\develop\mdk\cml2\MBox.h(27): note: see declaration of 'MBox::MBox' (compiling source file MPxDynamicCollisionTC.cpp)
    10>e:\raiderz\sourcecode\trunk\develop\mdk\cml2\MBox.h(323): error C2059: syntax error: ')' (compiling source file MPxDynamicCollisionTC.cpp)
    10>  MPxRagDollTC.cpp
    10>C:\Program Files (x86)\Microsoft Visual Studio 14.0\VC\include\hash_map(17): error C2338: <hash_map> is deprecated and will be REMOVED. Please use <unordered_map>. You can define _SILENCE_STDEXT_HASH_DEPRECATION_WARNINGS to acknowledge that you have received this warning. (compiling source file MPhysX4R3.cpp)
    10>C:\Program Files (x86)\Microsoft Visual Studio 14.0\VC\include\hash_map(17): error C2338: <hash_map> is deprecated and will be REMOVED. Please use <unordered_map>. You can define _SILENCE_STDEXT_HASH_DEPRECATION_WARNINGS to acknowledge that you have received this warning. (compiling source file MPxAttacherTC.cpp)
    10>C:\Program Files (x86)\Microsoft Visual Studio 14.0\VC\include\hash_map(17): error C2338: <hash_map> is deprecated and will be REMOVED. Please use <unordered_map>. You can define _SILENCE_STDEXT_HASH_DEPRECATION_WARNINGS to acknowledge that you have received this warning. (compiling source file MPxDynamicObjectEntity.cpp)
    10>C:\Program Files (x86)\Microsoft Visual Studio 14.0\VC\include\hash_map(17): error C2338: <hash_map> is deprecated and will be REMOVED. Please use <unordered_map>. You can define _SILENCE_STDEXT_HASH_DEPRECATION_WARNINGS to acknowledge that you have received this warning. (compiling source file MPxDynamicCollisionTC.cpp)
    10>C:\Program Files (x86)\Microsoft Visual Studio 14.0\VC\include\hash_map(17): error C2338: <hash_map> is deprecated and will be REMOVED. Please use <unordered_map>. You can define _SILENCE_STDEXT_HASH_DEPRECATION_WARNINGS to acknowledge that you have received this warning. (compiling source file MPxDynamicActorNodeTC.cpp)
    10>  RPhysXActorController.cpp
    10>  RPhysXDynamicActorNodeBuilder.cpp
    10>e:\raiderz\sourcecode\trunk\develop\mdk\cml2\MBox.h(323): error C2059: syntax error: '(' (compiling source file MPxRagDollTC.cpp)
    10>e:\raiderz\sourcecode\trunk\develop\mdk\cml2\MBox.h(323): error C2059: syntax error: 'constant' (compiling source file MPxRagDollTC.cpp)
    10>e:\raiderz\sourcecode\trunk\develop\mdk\cml2\MBox.h(323): error C2091: function returns function (compiling source file MPxRagDollTC.cpp)
    10>e:\raiderz\sourcecode\trunk\develop\mdk\cml2\MBox.h(323): error C2535: 'MBox::MBox(void)': member function already defined or declared (compiling source file MPxRagDollTC.cpp)
    10>  e:\raiderz\sourcecode\trunk\develop\mdk\cml2\MBox.h(27): note: see declaration of 'MBox::MBox' (compiling source file MPxRagDollTC.cpp)
    10>e:\raiderz\sourcecode\trunk\develop\mdk\cml2\MBox.h(323): error C2059: syntax error: ')' (compiling source file MPxRagDollTC.cpp)
    10>  RPhysXRagDollBuilder.cpp
    10>  RPhysXStream.cpp
    10>e:\raiderz\sourcecode\trunk\develop\mdk\cml2\MBox.h(323): error C2059: syntax error: '(' (compiling source file RPhysXActorController.cpp)
    10>e:\raiderz\sourcecode\trunk\develop\mdk\cml2\MBox.h(323): error C2059: syntax error: 'constant' (compiling source file RPhysXActorController.cpp)
    10>e:\raiderz\sourcecode\trunk\develop\mdk\cml2\MBox.h(323): error C2091: function returns function (compiling source file RPhysXActorController.cpp)
    10>e:\raiderz\sourcecode\trunk\develop\mdk\cml2\MBox.h(323): error C2535: 'MBox::MBox(void)': member function already defined or declared (compiling source file RPhysXActorController.cpp)
    10>  e:\raiderz\sourcecode\trunk\develop\mdk\cml2\MBox.h(27): note: see declaration of 'MBox::MBox' (compiling source file RPhysXActorController.cpp)
    10>e:\raiderz\sourcecode\trunk\develop\mdk\cml2\MBox.h(323): error C2059: syntax error: ')' (compiling source file RPhysXActorController.cpp)
    10>e:\raiderz\sourcecode\trunk\develop\mdk\cml2\MBox.h(323): error C2059: syntax error: '(' (compiling source file RPhysXDynamicActorNodeBuilder.cpp)
    10>e:\raiderz\sourcecode\trunk\develop\mdk\cml2\MBox.h(323): error C2059: syntax error: 'constant' (compiling source file RPhysXDynamicActorNodeBuilder.cpp)
    10>e:\raiderz\sourcecode\trunk\develop\mdk\cml2\MBox.h(323): error C2091: function returns function (compiling source file RPhysXDynamicActorNodeBuilder.cpp)
    10>e:\raiderz\sourcecode\trunk\develop\mdk\cml2\MBox.h(323): error C2535: 'MBox::MBox(void)': member function already defined or declared (compiling source file RPhysXDynamicActorNodeBuilder.cpp)
    10>  e:\raiderz\sourcecode\trunk\develop\mdk\cml2\MBox.h(27): note: see declaration of 'MBox::MBox' (compiling source file RPhysXDynamicActorNodeBuilder.cpp)
    10>e:\raiderz\sourcecode\trunk\develop\mdk\cml2\MBox.h(323): error C2059: syntax error: ')' (compiling source file RPhysXDynamicActorNodeBuilder.cpp)
    10>C:\Program Files (x86)\Microsoft Visual Studio 14.0\VC\include\hash_map(17): error C2338: <hash_map> is deprecated and will be REMOVED. Please use <unordered_map>. You can define _SILENCE_STDEXT_HASH_DEPRECATION_WARNINGS to acknowledge that you have received this warning. (compiling source file MPxRagDollTC.cpp)
    10>e:\raiderz\sourcecode\trunk\develop\mdk\cml2\MBox.h(323): error C2059: syntax error: '(' (compiling source file RPhysXRagDollBuilder.cpp)
    10>e:\raiderz\sourcecode\trunk\develop\mdk\cml2\MBox.h(323): error C2059: syntax error: 'constant' (compiling source file RPhysXRagDollBuilder.cpp)
    10>e:\raiderz\sourcecode\trunk\develop\mdk\cml2\MBox.h(323): error C2091: function returns function (compiling source file RPhysXRagDollBuilder.cpp)
    10>e:\raiderz\sourcecode\trunk\develop\mdk\cml2\MBox.h(323): error C2535: 'MBox::MBox(void)': member function already defined or declared (compiling source file RPhysXRagDollBuilder.cpp)
    10>  e:\raiderz\sourcecode\trunk\develop\mdk\cml2\MBox.h(27): note: see declaration of 'MBox::MBox' (compiling source file RPhysXRagDollBuilder.cpp)
    10>e:\raiderz\sourcecode\trunk\develop\mdk\cml2\MBox.h(323): error C2059: syntax error: ')' (compiling source file RPhysXRagDollBuilder.cpp)
    10>e:\raiderz\sourcecode\trunk\develop\mdk\cml2\MBox.h(323): error C2059: syntax error: '(' (compiling source file RPhysXStream.cpp)
    10>e:\raiderz\sourcecode\trunk\develop\mdk\cml2\MBox.h(323): error C2059: syntax error: 'constant' (compiling source file RPhysXStream.cpp)
    10>e:\raiderz\sourcecode\trunk\develop\mdk\cml2\MBox.h(323): error C2091: function returns function (compiling source file RPhysXStream.cpp)
    10>e:\raiderz\sourcecode\trunk\develop\mdk\cml2\MBox.h(323): error C2535: 'MBox::MBox(void)': member function already defined or declared (compiling source file RPhysXStream.cpp)
    10>  e:\raiderz\sourcecode\trunk\develop\mdk\cml2\MBox.h(27): note: see declaration of 'MBox::MBox' (compiling source file RPhysXStream.cpp)
    10>e:\raiderz\sourcecode\trunk\develop\mdk\cml2\MBox.h(323): error C2059: syntax error: ')' (compiling source file RPhysXStream.cpp)
    10>C:\Program Files (x86)\Microsoft Visual Studio 14.0\VC\include\hash_map(17): error C2338: <hash_map> is deprecated and will be REMOVED. Please use <unordered_map>. You can define _SILENCE_STDEXT_HASH_DEPRECATION_WARNINGS to acknowledge that you have received this warning. (compiling source file RPhysXActorController.cpp)
    10>C:\Program Files (x86)\Microsoft Visual Studio 14.0\VC\include\hash_map(17): error C2338: <hash_map> is deprecated and will be REMOVED. Please use <unordered_map>. You can define _SILENCE_STDEXT_HASH_DEPRECATION_WARNINGS to acknowledge that you have received this warning. (compiling source file RPhysXDynamicActorNodeBuilder.cpp)
    10>C:\Program Files (x86)\Microsoft Visual Studio 14.0\VC\include\hash_map(17): error C2338: <hash_map> is deprecated and will be REMOVED. Please use <unordered_map>. You can define _SILENCE_STDEXT_HASH_DEPRECATION_WARNINGS to acknowledge that you have received this warning. (compiling source file RPhysXRagDollBuilder.cpp)
    12>------ Build started: Project: GameLib, Configuration: Release Win32 ------
    12>  stdafx.cpp
    12>e:\raiderz\sourcecode\trunk\develop\mdk\cml2\MBox.h(323): error C2059: syntax error: '('
    12>e:\raiderz\sourcecode\trunk\develop\mdk\cml2\MBox.h(323): error C2059: syntax error: 'constant'
    12>e:\raiderz\sourcecode\trunk\develop\mdk\cml2\MBox.h(323): error C2091: function returns function
    12>e:\raiderz\sourcecode\trunk\develop\mdk\cml2\MBox.h(323): error C2535: 'MBox::MBox(void)': member function already defined or declared
    12>  e:\raiderz\sourcecode\trunk\develop\mdk\cml2\MBox.h(27): note: see declaration of 'MBox::MBox'
    12>e:\raiderz\sourcecode\trunk\develop\mdk\cml2\MBox.h(323): error C2059: syntax error: ')'
    12>C:\Program Files (x86)\Microsoft Visual Studio 14.0\VC\include\hash_map(17): error C2338: <hash_map> is deprecated and will be REMOVED. Please use <unordered_map>. You can define _SILENCE_STDEXT_HASH_DEPRECATION_WARNINGS to acknowledge that you have received this warning.
    13>------ Build started: Project: GameApp, Configuration: Release Win32 ------
    13>  stdafx.cpp
    13>e:\raiderz\sourcecode\trunk\develop\mdk\cml2\MBox.h(323): error C2059: syntax error: '('
    13>e:\raiderz\sourcecode\trunk\develop\mdk\cml2\MBox.h(323): error C2059: syntax error: 'constant'
    13>e:\raiderz\sourcecode\trunk\develop\mdk\cml2\MBox.h(323): error C2091: function returns function
    13>e:\raiderz\sourcecode\trunk\develop\mdk\cml2\MBox.h(323): error C2535: 'MBox::MBox(void)': member function already defined or declared
    13>  e:\raiderz\sourcecode\trunk\develop\mdk\cml2\MBox.h(27): note: see declaration of 'MBox::MBox'
    13>e:\raiderz\sourcecode\trunk\develop\mdk\cml2\MBox.h(323): error C2059: syntax error: ')'
    ========== Build: 0 succeeded, 13 failed, 3 up-to-date, 0 skipped ==========

  11. #41
    Member kiko87 is offline
    MemberRank
    Oct 2015 Join Date
    under a bridgeLocation
    33Posts

    Re: [Guide] How to Compile the Source

    it seems u dont use visual studio 2008 u try to upgrade project in a new version of visual studio?

  12. #42
    Newbie Albedaia is offline
    MemberRank
    Dec 2011 Join Date
    4Posts

    Re: [Guide] How to Compile the Source

    Quote Originally Posted by kiko87 View Post
    it seems u dont use visual studio 2008 u try to upgrade project in a new version of visual studio?
    yep i use visual studio 2015
    must i install visual studio 2008 ?

  13. #43
    Member kiko87 is offline
    MemberRank
    Oct 2015 Join Date
    under a bridgeLocation
    33Posts

    Re: [Guide] How to Compile the Source

    Quote Originally Posted by Albedaia View Post
    yep i use visual studio 2015
    must i install visual studio 2008 ?
    yes u need to use 2008
    Studio 2008 Professional Edition (90-day Trial), -- google serch this

  14. #44
    RaiderZ Coder Jose Lucas is offline
    True MemberRank
    Jun 2013 Join Date
    IngenLocation
    243Posts

    sad Re: [Guide] How to Compile the Source

    @cmb maybe you know why, but my coretools its crashing when i open a field file if i compile the .exe and the plugins, using the compiled one inside devkit works fine, any solution?




  15. #45
    RaiderZ Mod cmb is offline
    DeveloperRank
    Mar 2007 Join Date
    859Posts

    Re: [Guide] How to Compile the Source

    Quote Originally Posted by Jose Lucas View Post
    @cmb maybe you know why, but my coretools its crashing when i open a field file if i compile the .exe and the plugins, using the compiled one inside devkit works fine, any solution?
    are you getting any crashdumps? try debugging the application and see what its trying to do.



Page 3 of 3 FirstFirst 123

Advertisement