[Release] zTeam Season 8 Episode 2 (Source)

Page 25 of 216 FirstFirst ... 1517181920212223242526272829303132333575125 ... LastLast
Results 361 to 375 of 3227
  1. #361
    Registered skllskll is offline
    MemberRank
    Jul 2013 Join Date
    12Posts

    re: [Release] zTeam Season 8 Episode 2 (Source)

    [Release] zTeam Season 8 Episode 2 (Source)
    #if (ENABLETEST_NEWPVP == 1)
    #include "NewPVP.h"
    #endif

    错误 23 error LNK2001: 无法解析的外部符号 "class CNewPVP g_NewPVP" (?g_NewPVP@@3VCNewPVP@@A) C:\Users\Mirk\Desktop\GameServer\Source\user.obj GameServer

    why?

  2. #362
    Account Inactive Nujd is offline
    InactiveRank
    Jul 2012 Join Date
    United StatesLocation
    334Posts

    re: [Release] zTeam Season 8 Episode 2 (Source)

    1>------ Build started: Project: zGameServer, Configuration: Release Win32 ------
    1> StdAfx.cpp
    1>C:\Program Files (x86)\Microsoft Visual Studio 12.0\VC\atlmfc\include\atlcore.h(633): error C2159: more than one storage class specified
    1>C:\Program Files (x86)\Microsoft Visual Studio 12.0\VC\atlmfc\include\atlcore.h(633): error C4430: missing type specifier - int assumed. Note: C++ does not support default-int
    1>C:\Program Files (x86)\Microsoft Visual Studio 12.0\VC\atlmfc\include\atlcore.h(633): error C2440: 'initializing' : cannot convert from 'BOOL (__stdcall *)(DWORD)' to 'volatile int'
    1> There is no context in which this conversion is possible
    1>C:\Program Files (x86)\Microsoft Visual Studio 12.0\VC\atlmfc\include\atlcore.h(633): error C2440: 'initializing' : cannot convert from 'BOOL (__stdcall *)(DWORD)' to 'int'
    1> There is no context in which this conversion is possible
    1>C:\Program Files (x86)\Microsoft Visual Studio 12.0\VC\atlmfc\include\atlcore.h(633): error C2446: '==' : no conversion from 'BOOL (__stdcall *)(DWORD)' to 'int'
    1> There is no context in which this conversion is possible
    1>C:\Program Files (x86)\Microsoft Visual Studio 12.0\VC\atlmfc\include\atlcore.h(633): error C2040: '==' : 'int' differs in levels of indirection from 'BOOL (__stdcall *)(DWORD)'
    1>C:\Program Files (x86)\Microsoft Visual Studio 12.0\VC\atlmfc\include\atlcore.h(633): error C2440: '=' : cannot convert from 'BOOL (__stdcall *)(DWORD)' to 'int'
    1> There is no context in which this conversion is possible
    1>C:\Program Files (x86)\Microsoft Visual Studio 12.0\VC\atlmfc\include\atlcore.h(633): error C2440: '=' : cannot convert from 'BOOL (__stdcall *)(DWORD)' to 'volatile int'
    1> There is no context in which this conversion is possible
    1>C:\Program Files (x86)\Microsoft Visual Studio 12.0\VC\atlmfc\include\atlcore.h(633): error C2446: '!=' : no conversion from 'BOOL (__stdcall *)(DWORD)' to 'int'
    1> There is no context in which this conversion is possible
    1>C:\Program Files (x86)\Microsoft Visual Studio 12.0\VC\atlmfc\include\atlcore.h(633): error C2040: '!=' : 'int' differs in levels of indirection from 'BOOL (__stdcall *)(DWORD)'
    1>C:\Program Files (x86)\Microsoft Visual Studio 12.0\VC\include\xtr1common(421): error C2159: more than one storage class specified
    1> C:\Program Files (x86)\Microsoft Visual Studio 12.0\VC\include\xtr1common(421) : see reference to class template instantiation 'std::_Has_result_type<_Ty>' being compiled
    1>C:\Program Files (x86)\Microsoft Visual Studio 12.0\VC\include\xtr1common(421): error C3557: a function cannot have both a return type and a late-specified return type
    1>C:\Program Files (x86)\Microsoft Visual Studio 12.0\VC\include\xtr1common(421): error C4430: missing type specifier - int assumed. Note: C++ does not support default-int
    1>C:\Program Files (x86)\Microsoft Visual Studio 12.0\VC\include\xstddef(203): error C3557: a function cannot have both a return type and a late-specified return type
    1>C:\Program Files (x86)\Microsoft Visual Studio 12.0\VC\include\xstddef(203): warning C4042: 'std::plus<void>::operator ()' : has bad storage class
    1>C:\Program Files (x86)\Microsoft Visual Studio 12.0\VC\include\xstddef(203): error C4430: missing type specifier - int assumed. Note: C++ does not support default-int
    1>C:\Program Files (x86)\Microsoft Visual Studio 12.0\VC\include\xstddef(218): error C3557: a function cannot have both a return type and a late-specified return type
    1>C:\Program Files (x86)\Microsoft Visual Studio 12.0\VC\include\xstddef(218): warning C4042: 'std::minus<void>::operator ()' : has bad storage class
    1>C:\Program Files (x86)\Microsoft Visual Studio 12.0\VC\include\xstddef(218): error C4430: missing type specifier - int assumed. Note: C++ does not support default-int
    1>C:\Program Files (x86)\Microsoft Visual Studio 12.0\VC\include\xstddef(233): error C3557: a function cannot have both a return type and a late-specified return type
    1>C:\Program Files (x86)\Microsoft Visual Studio 12.0\VC\include\xstddef(233): warning C4042: 'std::multiplies<void>::operator ()' : has bad storage class
    1>C:\Program Files (x86)\Microsoft Visual Studio 12.0\VC\include\xstddef(233): error C4430: missing type specifier - int assumed. Note: C++ does not support default-int
    1>C:\Program Files (x86)\Microsoft Visual Studio 12.0\VC\include\xstddef(248): error C3557: a function cannot have both a return type and a late-specified return type
    1>C:\Program Files (x86)\Microsoft Visual Studio 12.0\VC\include\xstddef(248): warning C4042: 'std::equal_to<void>::operator ()' : has bad storage class
    1>C:\Program Files (x86)\Microsoft Visual Studio 12.0\VC\include\xstddef(248): error C4430: missing type specifier - int assumed. Note: C++ does not support default-int
    1>C:\Program Files (x86)\Microsoft Visual Studio 12.0\VC\include\xstddef(263): error C3557: a function cannot have both a return type and a late-specified return type
    1>C:\Program Files (x86)\Microsoft Visual Studio 12.0\VC\include\xstddef(263): warning C4042: 'std::less<void>::operator ()' : has bad storage class
    1>C:\Program Files (x86)\Microsoft Visual Studio 12.0\VC\include\xstddef(263): error C4430: missing type specifier - int assumed. Note: C++ does not support default-int
    1>C:\Program Files (x86)\Microsoft Visual Studio 12.0\VC\include\type_traits(686): error C2159: more than one storage class specified
    1> C:\Program Files (x86)\Microsoft Visual Studio 12.0\VC\include\type_traits(696) : see reference to class template instantiation 'std::_Is_assignable<_To,_From>' being compiled
    1>C:\Program Files (x86)\Microsoft Visual Studio 12.0\VC\include\type_traits(686): error C3557: a function cannot have both a return type and a late-specified return type
    1>C:\Program Files (x86)\Microsoft Visual Studio 12.0\VC\include\type_traits(686): error C4430: missing type specifier - int assumed. Note: C++ does not support default-int
    1>C:\Program Files (x86)\Microsoft Visual Studio 12.0\VC\include\type_traits(692): error C2159: more than one storage class specified
    1>C:\Program Files (x86)\Microsoft Visual Studio 12.0\VC\include\type_traits(692): error C3557: a function cannot have both a return type and a late-specified return type
    1>C:\Program Files (x86)\Microsoft Visual Studio 12.0\VC\include\type_traits(692): error C4430: missing type specifier - int assumed. Note: C++ does not support default-int
    1>C:\Program Files (x86)\Microsoft Visual Studio 12.0\VC\include\xrefwrap(458): error C2159: more than one storage class specified
    1> C:\Program Files (x86)\Microsoft Visual Studio 12.0\VC\include\xrefwrap(458) : see reference to class template instantiation 'std::_Has_result_and_arg_type<_Ty>' being compiled
    1>C:\Program Files (x86)\Microsoft Visual Studio 12.0\VC\include\xrefwrap(458): error C3557: a function cannot have both a return type and a late-specified return type
    1>C:\Program Files (x86)\Microsoft Visual Studio 12.0\VC\include\xrefwrap(458): error C4430: missing type specifier - int assumed. Note: C++ does not support default-int
    1>C:\Program Files (x86)\Microsoft Visual Studio 12.0\VC\include\xrefwrap(463): error C2159: more than one storage class specified
    1> C:\Program Files (x86)\Microsoft Visual Studio 12.0\VC\include\xrefwrap(463) : see reference to class template instantiation 'std::_Has_result_and_2arg_type<_Ty>' being compiled
    1>C:\Program Files (x86)\Microsoft Visual Studio 12.0\VC\include\xrefwrap(463): error C3557: a function cannot have both a return type and a late-specified return type
    1>C:\Program Files (x86)\Microsoft Visual Studio 12.0\VC\include\xrefwrap(463): error C4430: missing type specifier - int assumed. Note: C++ does not support default-int
    1>C:\Program Files (x86)\Microsoft Visual Studio 12.0\VC\include\xutility(263): error C2159: more than one storage class specified
    1> C:\Program Files (x86)\Microsoft Visual Studio 12.0\VC\include\xutility(263) : see reference to class template instantiation 'std::_Get_unchecked_type<_Ty>' being compiled
    1>C:\Program Files (x86)\Microsoft Visual Studio 12.0\VC\include\xutility(263): error C3557: a function cannot have both a return type and a late-specified return type
    1>C:\Program Files (x86)\Microsoft Visual Studio 12.0\VC\include\xutility(263): error C4430: missing type specifier - int assumed. Note: C++ does not support default-int
    1>C:\Program Files (x86)\Microsoft Visual Studio 12.0\VC\include\xutility(268): error C2159: more than one storage class specified
    1> C:\Program Files (x86)\Microsoft Visual Studio 12.0\VC\include\xutility(268) : see reference to class template instantiation 'std::_Is_checked_helper<_Ty>' being compiled
    1>C:\Program Files (x86)\Microsoft Visual Studio 12.0\VC\include\xutility(268): error C3557: a function cannot have both a return type and a late-specified return type
    1>C:\Program Files (x86)\Microsoft Visual Studio 12.0\VC\include\xutility(268): error C4430: missing type specifier - int assumed. Note: C++ does not support default-int
    1>C:\Program Files (x86)\Microsoft Visual Studio 12.0\VC\include\xutility(943): error C3557: a function cannot have both a return type and a late-specified return type
    1>C:\Program Files (x86)\Microsoft Visual Studio 12.0\VC\include\xutility(943): warning C4042: 'operator -' : has bad storage class
    1>C:\Program Files (x86)\Microsoft Visual Studio 12.0\VC\include\xutility(943): error C4430: missing type specifier - int assumed. Note: C++ does not support default-int
    1>C:\Program Files (x86)\Microsoft Visual Studio 12.0\VC\include\xutility(1135): error C3557: a function cannot have both a return type and a late-specified return type
    1>C:\Program Files (x86)\Microsoft Visual Studio 12.0\VC\include\xutility(1135): warning C4042: 'operator -' : has bad storage class
    1>C:\Program Files (x86)\Microsoft Visual Studio 12.0\VC\include\xutility(1135): error C4430: missing type specifier - int assumed. Note: C++ does not support default-int
    1>C:\Program Files (x86)\Microsoft Visual Studio 12.0\VC\include\xutility(1191): error C3557: a function cannot have both a return type and a late-specified return type
    1>C:\Program Files (x86)\Microsoft Visual Studio 12.0\VC\include\xutility(1191): warning C4042: 'begin' : has bad storage class
    1>C:\Program Files (x86)\Microsoft Visual Studio 12.0\VC\include\xutility(1191): error C4430: missing type specifier - int assumed. Note: C++ does not support default-int
    1>C:\Program Files (x86)\Microsoft Visual Studio 12.0\VC\include\xutility(1197): error C3557: a function cannot have both a return type and a late-specified return type
    1>C:\Program Files (x86)\Microsoft Visual Studio 12.0\VC\include\xutility(1197): warning C4042: 'begin' : has bad storage class
    1>C:\Program Files (x86)\Microsoft Visual Studio 12.0\VC\include\xutility(1197): error C4430: missing type specifier - int assumed. Note: C++ does not support default-int
    1>C:\Program Files (x86)\Microsoft Visual Studio 12.0\VC\include\xutility(1203): error C3557: a function cannot have both a return type and a late-specified return type
    1>C:\Program Files (x86)\Microsoft Visual Studio 12.0\VC\include\xutility(1203): warning C4042: 'end' : has bad storage class
    1>C:\Program Files (x86)\Microsoft Visual Studio 12.0\VC\include\xutility(1203): error C4430: missing type specifier - int assumed. Note: C++ does not support default-int
    1>C:\Program Files (x86)\Microsoft Visual Studio 12.0\VC\include\xutility(1209): error C3557: a function cannot have both a return type and a late-specified return type
    1>C:\Program Files (x86)\Microsoft Visual Studio 12.0\VC\include\xutility(1209): warning C4042: 'end' : has bad storage class
    1>C:\Program Files (x86)\Microsoft Visual Studio 12.0\VC\include\xutility(1209): error C4430: missing type specifier - int assumed. Note: C++ does not support default-int
    1>C:\Program Files (x86)\Microsoft Visual Studio 12.0\VC\include\xutility(1230): error C3557: a function cannot have both a return type and a late-specified return type
    1>C:\Program Files (x86)\Microsoft Visual Studio 12.0\VC\include\xutility(1230): warning C4042: 'cbegin' : has bad storage class
    1>C:\Program Files (x86)\Microsoft Visual Studio 12.0\VC\include\xutility(1230): error C4430: missing type specifier - int assumed. Note: C++ does not support default-int
    1>C:\Program Files (x86)\Microsoft Visual Studio 12.0\VC\include\xutility(1236): error C3557: a function cannot have both a return type and a late-specified return type
    1>C:\Program Files (x86)\Microsoft Visual Studio 12.0\VC\include\xutility(1236): warning C4042: 'cend' : has bad storage class
    1>C:\Program Files (x86)\Microsoft Visual Studio 12.0\VC\include\xutility(1236): error C4430: missing type specifier - int assumed. Note: C++ does not support default-int
    1>C:\Program Files (x86)\Microsoft Visual Studio 12.0\VC\include\xutility(1243): error C3557: a function cannot have both a return type and a late-specified return type
    1>C:\Program Files (x86)\Microsoft Visual Studio 12.0\VC\include\xutility(1243): warning C4042: 'rbegin' : has bad storage class
    1>C:\Program Files (x86)\Microsoft Visual Studio 12.0\VC\include\xutility(1243): error C4430: missing type specifier - int assumed. Note: C++ does not support default-int
    1>C:\Program Files (x86)\Microsoft Visual Studio 12.0\VC\include\xutility(1249): error C3557: a function cannot have both a return type and a late-specified return type
    1>C:\Program Files (x86)\Microsoft Visual Studio 12.0\VC\include\xutility(1249): warning C4042: 'rbegin' : has bad storage class
    1>C:\Program Files (x86)\Microsoft Visual Studio 12.0\VC\include\xutility(1249): error C4430: missing type specifier - int assumed. Note: C++ does not support default-int
    1>C:\Program Files (x86)\Microsoft Visual Studio 12.0\VC\include\xutility(1255): error C3557: a function cannot have both a return type and a late-specified return type
    1>C:\Program Files (x86)\Microsoft Visual Studio 12.0\VC\include\xutility(1255): warning C4042: 'rend' : has bad storage class
    1>C:\Program Files (x86)\Microsoft Visual Studio 12.0\VC\include\xutility(1255): error C4430: missing type specifier - int assumed. Note: C++ does not support default-int
    1>C:\Program Files (x86)\Microsoft Visual Studio 12.0\VC\include\xutility(1261): error C3557: a function cannot have both a return type and a late-specified return type
    1>C:\Program Files (x86)\Microsoft Visual Studio 12.0\VC\include\xutility(1261): warning C4042: 'rend' : has bad storage class
    1>C:\Program Files (x86)\Microsoft Visual Studio 12.0\VC\include\xutility(1261): error C4430: missing type specifier - int assumed. Note: C++ does not support default-int
    1>C:\Program Files (x86)\Microsoft Visual Studio 12.0\VC\include\xutility(1294): error C3557: a function cannot have both a return type and a late-specified return type
    1>C:\Program Files (x86)\Microsoft Visual Studio 12.0\VC\include\xutility(1294): warning C4042: 'crbegin' : has bad storage class
    1>C:\Program Files (x86)\Microsoft Visual Studio 12.0\VC\include\xutility(1294): error C4430: missing type specifier - int assumed. Note: C++ does not support default-int
    1>C:\Program Files (x86)\Microsoft Visual Studio 12.0\VC\include\xutility(1300): error C3557: a function cannot have both a return type and a late-specified return type
    1>C:\Program Files (x86)\Microsoft Visual Studio 12.0\VC\include\xutility(1300): warning C4042: 'crend' : has bad storage class
    1>C:\Program Files (x86)\Microsoft Visual Studio 12.0\VC\include\xutility(1300): error C4430: missing type specifier - int assumed. Note: C++ does not support default-int
    1>C:\Program Files (x86)\Microsoft Visual Studio 12.0\VC\include\xutility(1975): error C3557: a function cannot have both a return type and a late-specified return type
    1>C:\Program Files (x86)\Microsoft Visual Studio 12.0\VC\include\xutility(1975): warning C4042: 'operator -' : has bad storage class
    1>C:\Program Files (x86)\Microsoft Visual Studio 12.0\VC\include\xutility(1975): error C4430: missing type specifier - int assumed. Note: C++ does not support default-int
    1>C:\Program Files (x86)\Microsoft Visual Studio 12.0\VC\include\xutility(3436): error C2159: more than one storage class specified
    1> C:\Program Files (x86)\Microsoft Visual Studio 12.0\VC\include\xutility(3444) : see reference to class template instantiation 'std::_Has_allocator_type<_Ty,_Alloc>' being compiled
    1>C:\Program Files (x86)\Microsoft Visual Studio 12.0\VC\include\xutility(3436): error C3557: a function cannot have both a return type and a late-specified return type
    1>C:\Program Files (x86)\Microsoft Visual Studio 12.0\VC\include\xutility(3436): error C4430: missing type specifier - int assumed. Note: C++ does not support default-int
    1>C:\Program Files (x86)\Microsoft Visual Studio 12.0\VC\include\xutility(3440): error C2159: more than one storage class specified
    1>C:\Program Files (x86)\Microsoft Visual Studio 12.0\VC\include\xutility(3440): error C3557: a function cannot have both a return type and a late-specified return type
    1>C:\Program Files (x86)\Microsoft Visual Studio 12.0\VC\include\xutility(3440): error C4430: missing type specifier - int assumed. Note: C++ does not support default-int
    1>C:\Program Files (x86)\Microsoft Visual Studio 12.0\VC\include\xmemory0(181): error C2159: more than one storage class specified
    1> C:\Program Files (x86)\Microsoft Visual Studio 12.0\VC\include\xmemory0(181) : see reference to class template instantiation 'std::_Get_element_type<_Ty>' being compiled
    1>C:\Program Files (x86)\Microsoft Visual Studio 12.0\VC\include\xmemory0(181): error C3557: a function cannot have both a return type and a late-specified return type
    1>C:\Program Files (x86)\Microsoft Visual Studio 12.0\VC\include\xmemory0(181): error C4430: missing type specifier - int assumed. Note: C++ does not support default-int
    1>C:\Program Files (x86)\Microsoft Visual Studio 12.0\VC\include\xmemory0(187): error C2159: more than one storage class specified
    1> C:\Program Files (x86)\Microsoft Visual Studio 12.0\VC\include\xmemory0(187) : see reference to class template instantiation 'std::_Get_ptr_difference_type<_Ty>' being compiled
    1>C:\Program Files (x86)\Microsoft Visual Studio 12.0\VC\include\xmemory0(187): error C3557: a function cannot have both a return type and a late-specified return type
    1>C:\Program Files (x86)\Microsoft Visual Studio 12.0\VC\include\xmemory0(187): error C4430: missing type specifier - int assumed. Note: C++ does not support default-int
    1>C:\Program Files (x86)\Microsoft Visual Studio 12.0\VC\include\xmemory0(194): error C2159: more than one storage class specified
    1> C:\Program Files (x86)\Microsoft Visual Studio 12.0\VC\include\xmemory0(194) : see reference to class template instantiation 'std::_Get_rebind_type<_Ty,_Other>' being compiled
    1>C:\Program Files (x86)\Microsoft Visual Studio 12.0\VC\include\xmemory0(194): error C3557: a function cannot have both a return type and a late-specified return type
    1>C:\Program Files (x86)\Microsoft Visual Studio 12.0\VC\include\xmemory0(194): error C4430: missing type specifier - int assumed. Note: C++ does not support default-int
    1>C:\Program Files (x86)\Microsoft Visual Studio 12.0\VC\include\xmemory0(242): error C2159: more than one storage class specified
    1> C:\Program Files (x86)\Microsoft Visual Studio 12.0\VC\include\xmemory0(242) : see reference to class template instantiation 'std::_Get_pointer_type<_Ty>' being compiled
    1>C:\Program Files (x86)\Microsoft Visual Studio 12.0\VC\include\xmemory0(242): error C3557: a function cannot have both a return type and a late-specified return type
    1>C:\Program Files (x86)\Microsoft Visual Studio 12.0\VC\include\xmemory0(242): error C4430: missing type specifier - int assumed. Note: C++ does not support default-int
    1>C:\Program Files (x86)\Microsoft Visual Studio 12.0\VC\include\xmemory0(249): error C2159: more than one storage class specified
    1> C:\Program Files (x86)\Microsoft Visual Studio 12.0\VC\include\xmemory0(249) : see reference to class template instantiation 'std::_Get_const_pointer_type<_Ty>' being compiled
    1>C:\Program Files (x86)\Microsoft Visual Studio 12.0\VC\include\xmemory0(249): error C3557: a function cannot have both a return type and a late-specified return type
    1>C:\Program Files (x86)\Microsoft Visual Studio 12.0\VC\include\xmemory0(249): error C4430: missing type specifier - int assumed. Note: C++ does not support default-int
    1>C:\Program Files (x86)\Microsoft Visual Studio 12.0\VC\include\xmemory0(256): error C2159: more than one storage class specified
    1> C:\Program Files (x86)\Microsoft Visual Studio 12.0\VC\include\xmemory0(256) : see reference to class template instantiation 'std::_Get_void_pointer_type<_Ty>' being compiled
    1>C:\Program Files (x86)\Microsoft Visual Studio 12.0\VC\include\xmemory0(256): error C3557: a function cannot have both a return type and a late-specified return type
    1>C:\Program Files (x86)\Microsoft Visual Studio 12.0\VC\include\xmemory0(256): error C4430: missing type specifier - int assumed. Note: C++ does not support default-int
    1>C:\Program Files (x86)\Microsoft Visual Studio 12.0\VC\include\xmemory0(263): error C2159: more than one storage class specified
    1> C:\Program Files (x86)\Microsoft Visual Studio 12.0\VC\include\xmemory0(263) : see reference to class template instantiation 'std::_Get_const_void_pointer_type<_Ty>' being compiled
    1>C:\Program Files (x86)\Microsoft Visual Studio 12.0\VC\include\xmemory0(263): error C3557: a function cannot have both a return type and a late-specified return type
    1>C:\Program Files (x86)\Microsoft Visual Studio 12.0\VC\include\xmemory0(263): error C4430: missing type specifier - int assumed. Note: C++ does not support default-int
    1>C:\Program Files (x86)\Microsoft Visual Studio 12.0\VC\include\xmemory0(270): error C2159: more than one storage class specified
    1> C:\Program Files (x86)\Microsoft Visual Studio 12.0\VC\include\xmemory0(270) : see reference to class template instantiation 'std::_Get_difference_type<_Ty>' being compiled
    1>C:\Program Files (x86)\Microsoft Visual Studio 12.0\VC\include\xmemory0(270): error C3557: a function cannot have both a return type and a late-specified return type
    1>C:\Program Files (x86)\Microsoft Visual Studio 12.0\VC\include\xmemory0(270): error C4430: missing type specifier - int assumed. Note: C++ does not support default-int
    1>C:\Program Files (x86)\Microsoft Visual Studio 12.0\VC\include\xmemory0(277): error C2159: more than one storage class specified
    1> C:\Program Files (x86)\Microsoft Visual Studio 12.0\VC\include\xmemory0(277) : see reference to class template instantiation 'std::_Get_size_type<_Ty>' being compiled
    1>C:\Program Files (x86)\Microsoft Visual Studio 12.0\VC\include\xmemory0(277): error C3557: a function cannot have both a return type and a late-specified return type
    1>C:\Program Files (x86)\Microsoft Visual Studio 12.0\VC\include\xmemory0(277): error C4430: missing type specifier - int assumed. Note: C++ does not support default-int
    1>C:\Program Files (x86)\Microsoft Visual Studio 12.0\VC\include\xmemory0(283): error C2159: more than one storage class specified
    1> C:\Program Files (x86)\Microsoft Visual Studio 12.0\VC\include\xmemory0(283) : see reference to class template instantiation 'std::_Get_propagate_on_container_copy<_Ty>' being compiled
    1>C:\Program Files (x86)\Microsoft Visual Studio 12.0\VC\include\xmemory0(283): error C3557: a function cannot have both a return type and a late-specified return type
    1>C:\Program Files (x86)\Microsoft Visual Studio 12.0\VC\include\xmemory0(283): error C4430: missing type specifier - int assumed. Note: C++ does not support default-int
    1>C:\Program Files (x86)\Microsoft Visual Studio 12.0\VC\include\xmemory0(289): error C2159: more than one storage class specified
    1> C:\Program Files (x86)\Microsoft Visual Studio 12.0\VC\include\xmemory0(289) : see reference to class template instantiation 'std::_Get_propagate_on_container_move<_Ty>' being compiled
    1>C:\Program Files (x86)\Microsoft Visual Studio 12.0\VC\include\xmemory0(289): error C3557: a function cannot have both a return type and a late-specified return type
    1>C:\Program Files (x86)\Microsoft Visual Studio 12.0\VC\include\xmemory0(289): error C4430: missing type specifier - int assumed. Note: C++ does not support default-int
    1>C:\Program Files (x86)\Microsoft Visual Studio 12.0\VC\include\xmemory0(295): error C2159: more than one storage class specified
    1> C:\Program Files (x86)\Microsoft Visual Studio 12.0\VC\include\xmemory0(295) : see reference to class template instantiation 'std::_Get_propagate_on_container_swap<_Ty>' being compiled
    1>C:\Program Files (x86)\Microsoft Visual Studio 12.0\VC\include\xmemory0(295): error C3557: a function cannot have both a return type and a late-specified return type
    1>C:\Program Files (x86)\Microsoft Visual Studio 12.0\VC\include\xmemory0(295): error C4430: missing type specifier - int assumed. Note: C++ does not support default-int
    1>C:\Program Files (x86)\Microsoft Visual Studio 12.0\VC\include\xmemory0(305): error C2159: more than one storage class specified
    1>C:\Program Files (x86)\Microsoft Visual Studio 12.0\VC\include\xmemory0(311): error C3557: a function cannot have both a return type and a late-specified return type
    1>C:\Program Files (x86)\Microsoft Visual Studio 12.0\VC\include\xmemory0(311): error C4430: missing type specifier - int assumed. Note: C++ does not support default-int
    1>C:\Program Files (x86)\Microsoft Visual Studio 12.0\VC\include\xmemory0(316): error C2159: more than one storage class specified
    1>C:\Program Files (x86)\Microsoft Visual Studio 12.0\VC\include\xmemory0(322): error C3557: a function cannot have both a return type and a late-specified return type
    1>C:\Program Files (x86)\Microsoft Visual Studio 12.0\VC\include\xmemory0(322): error C4430: missing type specifier - int assumed. Note: C++ does not support default-int
    1>C:\Program Files (x86)\Microsoft Visual Studio 12.0\VC\include\xmemory0(333): error C2159: more than one storage class specified
    1>C:\Program Files (x86)\Microsoft Visual Studio 12.0\VC\include\xmemory0(339): error C3557: a function cannot have both a return type and a late-specified return type
    1>C:\Program Files (x86)\Microsoft Visual Studio 12.0\VC\include\xmemory0(339): error C4430: missing type specifier - int assumed. Note: C++ does not support default-int
    1>C:\Program Files (x86)\Microsoft Visual Studio 12.0\VC\include\xmemory0(344): error C2159: more than one storage class specified
    1>C:\Program Files (x86)\Microsoft Visual Studio 12.0\VC\include\xmemory0(350): error C3557: a function cannot have both a return type and a late-specified return type
    1>C:\Program Files (x86)\Microsoft Visual Studio 12.0\VC\include\xmemory0(350): error C4430: missing type specifier - int assumed. Note: C++ does not support default-int
    1>C:\Program Files (x86)\Microsoft Visual Studio 12.0\VC\include\xmemory0(359): error C2159: more than one storage class specified
    1>C:\Program Files (x86)\Microsoft Visual Studio 12.0\VC\include\xmemory0(363): error C3557: a function cannot have both a return type and a late-specified return type
    1>C:\Program Files (x86)\Microsoft Visual Studio 12.0\VC\include\xmemory0(363): error C4430: missing type specifier - int assumed. Note: C++ does not support default-int
    1>C:\Program Files (x86)\Microsoft Visual Studio 12.0\VC\include\xmemory0(367): error C2159: more than one storage class specified
    1>C:\Program Files (x86)\Microsoft Visual Studio 12.0\VC\include\xmemory0(371): error C3557: a function cannot have both a return type and a late-specified return type
    1>C:\Program Files (x86)\Microsoft Visual Studio 12.0\VC\include\xmemory0(371): error C4430: missing type specifier - int assumed. Note: C++ does not support default-int
    1>C:\Program Files (x86)\Microsoft Visual Studio 12.0\VC\include\xmemory0(378): error C2159: more than one storage class specified
    1>C:\Program Files (x86)\Microsoft Visual Studio 12.0\VC\include\xmemory0(382): error C3557: a function cannot have both a return type and a late-specified return type
    1>C:\Program Files (x86)\Microsoft Visual Studio 12.0\VC\include\xmemory0(382): error C4430: missing type specifier - int assumed. Note: C++ does not support default-int
    1>C:\Program Files (x86)\Microsoft Visual Studio 12.0\VC\include\xmemory0(385): error C2159: more than one storage class specified
    1>C:\Program Files (x86)\Microsoft Visual Studio 12.0\VC\include\xmemory0(389): error C3557: a function cannot have both a return type and a late-specified return type
    1>C:\Program Files (x86)\Microsoft Visual Studio 12.0\VC\include\xmemory0(389): error C4430: missing type specifier - int assumed. Note: C++ does not support default-int
    1>C:\Program Files (x86)\Microsoft Visual Studio 12.0\VC\include\xmemory0(398): error C2159: more than one storage class specified
    1>C:\Program Files (x86)\Microsoft Visual Studio 12.0\VC\include\xmemory0(402): error C3557: a function cannot have both a return type and a late-specified return type
    1>C:\Program Files (x86)\Microsoft Visual Studio 12.0\VC\include\xmemory0(402): error C4430: missing type specifier - int assumed. Note: C++ does not support default-int
    1>C:\Program Files (x86)\Microsoft Visual Studio 12.0\VC\include\xmemory0(405): error C2159: more than one storage class specified
    1>C:\Program Files (x86)\Microsoft Visual Studio 12.0\VC\include\xmemory0(409): error C3557: a function cannot have both a return type and a late-specified return type
    1>C:\Program Files (x86)\Microsoft Visual Studio 12.0\VC\include\xmemory0(409): error C4430: missing type specifier - int assumed. Note: C++ does not support default-int
    ========== Build: 0 succeeded, 1 failed, 0 up-to-date, 0 skipped ==========


    someone help me how to fix this?

  3. #363
    Put Community First fallenfate is offline
    True MemberRank
    Oct 2014 Join Date
    Arad DomanLocation
    1,105Posts

    re: [Release] zTeam Season 8 Episode 2 (Source)

    Quote Originally Posted by Nujd View Post
    ::long-ass bunch of errors::

    someone help me how to fix this?
    Do you need to use VS2012? VS2008 is recommended for zGameServer and zMultiServer, and VS2010 for the client. All compiles fine using those.

    Also, I recommend when posting a tonne of errors like this, that people use the spoiler tags to keep page length shorter for people skimming to reply to other posts.
    If I helped you, please click the Like button at bottom-left of my posts. Thank you! :)
    I am also vasheni at deviantArt.com.

  4. #364
    Account Inactive Nujd is offline
    InactiveRank
    Jul 2012 Join Date
    United StatesLocation
    334Posts

    re: [Release] zTeam Season 8 Episode 2 (Source)

    Quote Originally Posted by fallenfate View Post
    Do you need to use VS2012? VS2008 is recommended for zGameServer and zMultiServer, and VS2010 for the client. All compiles fine using those.

    Also, I recommend when posting a tonne of errors like this, that people use the spoiler tags to keep page length shorter for people skimming to reply to other posts.


    im using vs2013

  5. #365
    Put Community First fallenfate is offline
    True MemberRank
    Oct 2014 Join Date
    Arad DomanLocation
    1,105Posts

    re: [Release] zTeam Season 8 Episode 2 (Source)

    Quote Originally Posted by Nujd View Post
    im using vs2013
    Okay, well people have had issues compiling with 2013, not sure if any fixes were provided but skim back through the last 10 pages of this thread or so, I believe it was something about requiring extra libraries, but I don't know which so you'll have to check that in the posts. Otherwise I highly recommend using the VSs I recommend above.

    EDIT: @Nujd, here is the post with a fix - https://forum.ragezone.com/f197/ztea...0/#post8447610
    Last edited by fallenfate; 26-06-15 at 07:35 AM.
    If I helped you, please click the Like button at bottom-left of my posts. Thank you! :)
    I am also vasheni at deviantArt.com.

  6. #366
    Hmm.. huh? MrQU3ST10N is offline
    True MemberRank
    Jun 2013 Join Date
    Trojan St. 404Location
    1,111Posts

    re: [Release] zTeam Season 8 Episode 2 (Source)

    Quote Originally Posted by The Interview View Post
    Its Disabled Already. But still getting those error.
    add command line /Zc-auto-

  7. #367
    Account Inactive Nujd is offline
    InactiveRank
    Jul 2012 Join Date
    United StatesLocation
    334Posts

    re: [Release] zTeam Season 8 Episode 2 (Source)

    Quote Originally Posted by fallenfate View Post
    Okay, well people have had issues compiling with 2013, not sure if any fixes were provided but skim back through the last 10 pages of this thread or so, I believe it was something about requiring extra libraries, but I don't know which so you'll have to check that in the posts. Otherwise I highly recommend using the VSs I recommend above.

    EDIT: @Nujd, here is the post with a fix - https://forum.ragezone.com/f197/ztea...0/#post8447610
    i finished download it and get error too

  8. #368
    Registered Stefan Sis is offline
    MemberRank
    Feb 2014 Join Date
    16Posts

    re: [Release] zTeam Season 8 Episode 2 (Source)

    So can enyone share the latest working filles?

  9. #369
    Put Community First fallenfate is offline
    True MemberRank
    Oct 2014 Join Date
    Arad DomanLocation
    1,105Posts

    re: [Release] zTeam Season 8 Episode 2 (Source)

    Quote Originally Posted by Stefan Sis View Post
    So can enyone share the latest working filles?
    These do work, unless you mean bug-less. It'll be a while before everyone manages to iron them out, I think, as this was a recent source release. If you just want to play and don't care about bugs, use my compiled server and client:

    https://forum.ragezone.com/f197/ztea...ml#post8445224
    If I helped you, please click the Like button at bottom-left of my posts. Thank you! :)
    I am also vasheni at deviantArt.com.

  10. #370
    Account Upgraded | Title Enabled! jackbot is offline
    True MemberRank
    Jan 2014 Join Date
    209Posts

    re: [Release] zTeam Season 8 Episode 2 (Source)

    Got master skill RF fully works xD




  11. #371
    DeV MuCMS Developer reseter is offline
    True MemberRank
    Jun 2013 Join Date
    Error 404Location
    476Posts

    re: [Release] zTeam Season 8 Episode 2 (Source)

    Quote Originally Posted by jackbot View Post
    Got master skill RF fully works xD



    Hey,can you share it? i hope for sharing xD :)
    If i helped Press Like

  12. #372
    Hmm.. huh? MrQU3ST10N is offline
    True MemberRank
    Jun 2013 Join Date
    Trojan St. 404Location
    1,111Posts

    re: [Release] zTeam Season 8 Episode 2 (Source)

    @jackbot
    can you tell us how did you do it?

  13. #373
    -( . ) ( . )- clerigz is offline
    True MemberRank
    Mar 2012 Join Date
    1,365Posts

    re: [Release] zTeam Season 8 Episode 2 (Source)

    what did you fix in that?

  14. #374
    Account Inactive Nujd is offline
    InactiveRank
    Jul 2012 Join Date
    United StatesLocation
    334Posts

    re: [Release] zTeam Season 8 Episode 2 (Source)

    1> cryptlib.lib(cryptlib.obj) : MSIL .netmodule or module compiled with /GL found; restarting link with /LTCG; add /LTCG to the link command line to improve linker performance
    1>LINK : warning LNK4075: ignoring '/INCREMENTAL' due to '/LTCG' specification
    1>cryptlib.lib(cryptlib.obj) : error LNK2001: unresolved external symbol "public: static void __cdecl std::_String_base::_Xlen(void)" (?_Xlen@_String_base@std@@SAXXZ)
    1>cryptlib.lib(cryptlib.obj) : error LNK2001: unresolved external symbol "public: static void __cdecl std::_String_base::_Xran(void)" (?_Xran@_String_base@std@@SAXXZ)
    1>C:\Users\NUJD\Desktop\GameServer2\Release\zGameServer.exe : fatal error LNK1120: 2 unresolved externals

    i finish compile crypto. then i got this error
    someone help me fix this?

  15. #375
    -( . ) ( . )- clerigz is offline
    True MemberRank
    Mar 2012 Join Date
    1,365Posts

    re: [Release] zTeam Season 8 Episode 2 (Source)

    any one can help me about this??




Advertisement