Compile the source files+Release vc2003/source

Mon Oct 25 17:59:12 2010
0 - CERT_CONNECTED
Mon Oct 25 17:59:12 2010
15 - CERT_DISCONNECT
network error:64
Mon Oct 25 18:00:21 2010
0 - CERT_CONNECTED
Mon Oct 25 18:00:21 2010
15 - CERT_DISCONNECT
network error:64
thats it
 
Maybe _Network\ggsrvlib26_MT.lib would be better.
Well my problem is everything compiles fine. I start my files.
I start the Neuz - till then no error. But when I try to log me in
it says Connection not available...

login fixed my last is account have many error about ',' and '<'

---------- Post added at 04:37 PM ---------- Previous post was at 04:31 PM ----------

Code:
------ Rebuild All started: Project: AccountServer, Configuration: Release Win32 ------

Deleting intermediate files and output files for project 'AccountServer', configuration 'Release|Win32'.
Compiling...
StdAfx.cpp
Compiling...
dpBillingTH.cpp
c:\FlyFFVERSION15\NeuroSpace\AccountServer\dpsrvr.h(20) : error C2143: syntax error : missing ',' before '<'
c:\FlyFFVERSION15\NeuroSpace\AccountServer\dpBillingTH.h(17) : error C2143: syntax error : missing ',' before '<'
dpBilling.cpp
c:\FlyFFVERSION15\NeuroSpace\AccountServer\dpsrvr.h(20) : error C2143: syntax error : missing ',' before '<'
c:\FlyFFVERSION15\NeuroSpace\AccountServer\dpBilling.h(17) : error C2143: syntax error : missing ',' before '<'
dpadbill.cpp
c:\FlyFFVERSION15\NeuroSpace\AccountServer\dpdbsrvr.h(14) : error C2143: syntax error : missing ',' before '<'
c:\FlyFFVERSION15\NeuroSpace\AccountServer\dpadbill.h(10) : error C2143: syntax error : missing ',' before '<'
BillingMgrTW.cpp
c:\FlyFFVERSION15\NeuroSpace\AccountServer\dpsrvr.h(20) : error C2143: syntax error : missing ',' before '<'
c:\FlyFFVERSION15\NeuroSpace\AccountServer\dpdbsrvr.h(14) : error C2143: syntax error : missing ',' before '<'
BillingMgrTH.cpp
c:\FlyFFVERSION15\NeuroSpace\AccountServer\dpBillingTH.h(17) : error C2143: syntax error : missing ',' before '<'
c:\FlyFFVERSION15\NeuroSpace\AccountServer\dpsrvr.h(20) : error C2143: syntax error : missing ',' before '<'
c:\FlyFFVERSION15\NeuroSpace\AccountServer\dpdbsrvr.h(14) : error C2143: syntax error : missing ',' before '<'
BillingMgrJP2.cpp
c:\FlyFFVERSION15\NeuroSpace\AccountServer\dpsrvr.h(20) : error C2143: syntax error : missing ',' before '<'
c:\FlyFFVERSION15\NeuroSpace\AccountServer\dpdbsrvr.h(14) : error C2143: syntax error : missing ',' before '<'
BillingMgrJP.cpp
c:\FlyFFVERSION15\NeuroSpace\AccountServer\dpBilling.h(17) : error C2143: syntax error : missing ',' before '<'
c:\FlyFFVERSION15\NeuroSpace\AccountServer\dpsrvr.h(20) : error C2143: syntax error : missing ',' before '<'
c:\FlyFFVERSION15\NeuroSpace\AccountServer\dpdbsrvr.h(14) : error C2143: syntax error : missing ',' before '<'
BillingMgr.cpp
exceptionhandler.cpp
Query.cpp
xUtil.cpp
vutil.cpp
timer.cpp
scanner.cpp
memtrace.cpp
file.cpp
debug.cpp
dxutil.cpp
sock.cpp
\FlyFFVERSION15\NeuroSpace\_Network\Net2\src\sock.cpp(8) : error C2065: 'm_dwcrc' : undeclared identifier
crc.cpp
Generating Code...
Compiling...
buffer.cpp
\FlyFFVERSION15\NeuroSpace\_Network\Net2\src\buffer.cpp(14) : error C2065: 'CBuffer3' : undeclared identifier
\FlyFFVERSION15\NeuroSpace\_Network\Net2\src\buffer.cpp(14) : error C2955: 'MemPooler' : use of class template requires template argument list
        ..\_Network\Misc\Include\MEMPOOLER.H(151) : see declaration of 'MemPooler'
\FlyFFVERSION15\NeuroSpace\_Network\Net2\src\buffer.cpp(14) : fatal error C1903: unable to recover from previous error(s); stopping compilation
mytrace.cpp
heapmng.cpp
ar.cpp
globalgiftbox.cpp
..\_Network\Net\Include\dpmng.h(86) : error C2990: 'CDPMng' : non-template class has already been defined as a template class
        c:\FlyFFVERSION15\NeuroSpace\AccountServer\globalgiftbox.h(8) : see declaration of 'CDPMng'
..\_Network\Net\Include\dpmng.h(131) : error C2955: 'CDPMng' : use of class template requires template argument list
        c:\FlyFFVERSION15\NeuroSpace\AccountServer\globalgiftbox.h(8) : see declaration of 'CDPMng'
..\_Network\Net\Include\dpmng.h(131) : error C2955: 'CDPMng' : use of class template requires template argument list
        c:\FlyFFVERSION15\NeuroSpace\AccountServer\globalgiftbox.h(8) : see declaration of 'CDPMng'
..\_Network\Net\Include\dpmng.h(131) : error C2027: use of undefined type 'CDPMng'
        c:\FlyFFVERSION15\NeuroSpace\AccountServer\globalgiftbox.h(8) : see declaration of 'CDPMng'
..\_Network\Net\Include\dpmng.h(133) : error C2065: 'm_pDPSock' : undeclared identifier
..\_Network\Net\Include\dpmng.h(133) : error C2227: left of '->GetRecvHandle' must point to class/struct/union
        type is ''unknown-type''
..\_Network\Net\Include\dpmng.h(136) : error C2955: 'CDPMng' : use of class template requires template argument list
        c:\FlyFFVERSION15\NeuroSpace\AccountServer\globalgiftbox.h(8) : see declaration of 'CDPMng'
..\_Network\Net\Include\dpmng.h(136) : error C2955: 'CDPMng' : use of class template requires template argument list
        c:\FlyFFVERSION15\NeuroSpace\AccountServer\globalgiftbox.h(8) : see declaration of 'CDPMng'
..\_Network\Net\Include\dpmng.h(136) : error C2027: use of undefined type 'CDPMng'
        c:\FlyFFVERSION15\NeuroSpace\AccountServer\globalgiftbox.h(8) : see declaration of 'CDPMng'
..\_Network\Net\Include\dpmng.h(138) : error C2065: 'm_hClose' : undeclared identifier
..\_Network\Net\Include\dpmng.h(155) : error C2955: 'CDPMng' : use of class template requires template argument list
        c:\FlyFFVERSION15\NeuroSpace\AccountServer\globalgiftbox.h(8) : see declaration of 'CDPMng'
..\_Network\Net\Include\dpmng.h(155) : error C2955: 'CDPMng' : use of class template requires template argument list
        c:\FlyFFVERSION15\NeuroSpace\AccountServer\globalgiftbox.h(8) : see declaration of 'CDPMng'
..\_Network\Net\Include\dpmng.h(155) : error C2027: use of undefined type 'CDPMng'
        c:\FlyFFVERSION15\NeuroSpace\AccountServer\globalgiftbox.h(8) : see declaration of 'CDPMng'
..\_Network\Net\Include\dpmng.h(157) : error C3861: 'CreateDPObject': identifier not found, even with argument-dependent lookup
..\_Network\Net\Include\dpmng.h(158) : error C3861: 'InitConnection': identifier not found, even with argument-dependent lookup
..\_Network\Net\Include\dpmng.h(159) : error C3861: 'CreateSession': identifier not found, even with argument-dependent lookup
..\_Network\Net\Include\dpmng.h(161) : error C2955: 'CDPMng' : use of class template requires template argument list
        c:\FlyFFVERSION15\NeuroSpace\AccountServer\globalgiftbox.h(8) : see declaration of 'CDPMng'
..\_Network\Net\Include\dpmng.h(161) : error C2955: 'CDPMng' : use of class template requires template argument list
        c:\FlyFFVERSION15\NeuroSpace\AccountServer\globalgiftbox.h(8) : see declaration of 'CDPMng'
..\_Network\Net\Include\dpmng.h(161) : error C2027: use of undefined type 'CDPMng'
        c:\FlyFFVERSION15\NeuroSpace\AccountServer\globalgiftbox.h(8) : see declaration of 'CDPMng'
..\_Network\Net\Include\dpmng.h(163) : error C3861: 'CreateDPObject': identifier not found, even with argument-dependent lookup
..\_Network\Net\Include\dpmng.h(164) : error C3861: 'InitConnection': identifier not found, even with argument-dependent lookup
..\_Network\Net\Include\dpmng.h(165) : error C3861: 'JoinSession': identifier not found, even with argument-dependent lookup
..\_Network\Net\Include\dpmng.h(169) : error C2955: 'CDPMng' : use of class template requires template argument list
        c:\FlyFFVERSION15\NeuroSpace\AccountServer\globalgiftbox.h(8) : see declaration of 'CDPMng'
..\_Network\Net\Include\dpmng.h(169) : error C2955: 'CDPMng' : use of class template requires template argument list
        c:\FlyFFVERSION15\NeuroSpace\AccountServer\globalgiftbox.h(8) : see declaration of 'CDPMng'
..\_Network\Net\Include\dpmng.h(169) : error C2027: use of undefined type 'CDPMng'
        c:\FlyFFVERSION15\NeuroSpace\AccountServer\globalgiftbox.h(8) : see declaration of 'CDPMng'
..\_Network\Net\Include\dpmng.h(171) : error C3861: 'm_pDPSock': identifier not found, even with argument-dependent lookup
..\_Network\Net\Include\dpmng.h(173) : error C2227: left of '->Send' must point to class/struct/union
        type is ''unknown-type''
..\_Network\Net\Include\dpmng.h(173) : error C3861: 'm_pDPSock': identifier not found, even with argument-dependent lookup
globalgiftbox.cpp(78) : error C2955: 'CDPMng' : use of class template requires template argument list
        c:\FlyFFVERSION15\NeuroSpace\AccountServer\globalgiftbox.h(8) : see declaration of 'CDPMng'
globalgiftbox.cpp(79) : error C2511: 'void CGlobalGiftbox::OnQuery(CDPMng *,CAr &,DPID)' : overloaded member function not found in 'CGlobalGiftbox'
        c:\FlyFFVERSION15\NeuroSpace\AccountServer\globalgiftbox.h(10) : see declaration of 'CGlobalGiftbox'
dpwldsrvr.cpp
c:\FlyFFVERSION15\NeuroSpace\AccountServer\dpwldsrvr.h(12) : error C2143: syntax error : missing ',' before '<'
c:\FlyFFVERSION15\NeuroSpace\AccountServer\globalgiftbox.h(8) : error C2989: 'CDPMng' : template class has already been defined as a non-template class
        ..\_Network\Net\Include\dpmng.h(86) : see declaration of 'CDPMng'
c:\FlyFFVERSION15\NeuroSpace\AccountServer\globalgiftbox.h(7) : error C3857: 'CDPMng': multiple template parameter lists are not allowed
c:\FlyFFVERSION15\NeuroSpace\AccountServer\globalgiftbox.h(24) : error C2259: 'CDPMng' : cannot instantiate abstract class
        due to following members:
        'void CDPMng::SysMessageHandler(LPDPMSG_GENERIC,DWORD,DPID)' : pure virtual function was not defined
        ..\_Network\Net\Include\dpmng.h(127) : see declaration of 'CDPMng::SysMessageHandler'
        'void CDPMng::UserMessageHandler(LPDPMSG_GENERIC,DWORD,DPID)' : pure virtual function was not defined
        ..\_Network\Net\Include\dpmng.h(128) : see declaration of 'CDPMng::UserMessageHandler'
c:\FlyFFVERSION15\NeuroSpace\AccountServer\globalgiftbox.h(24) : error C2143: syntax error : missing ')' before '<'
c:\FlyFFVERSION15\NeuroSpace\AccountServer\globalgiftbox.h(24) : error C2143: syntax error : missing ';' before '<'
c:\FlyFFVERSION15\NeuroSpace\AccountServer\globalgiftbox.h(24) : error C2059: syntax error : ')'
c:\FlyFFVERSION15\NeuroSpace\AccountServer\globalgiftbox.h(24) : error C2238: unexpected token(s) preceding ';'
dpwldsrvr.cpp(56) : error C2660: 'CGlobalGiftbox::OnQuery' : function does not take 3 arguments
dpsrvr.cpp
c:\FlyFFVERSION15\NeuroSpace\AccountServer\dpdbsrvr.h(14) : error C2143: syntax error : missing ',' before '<'
c:\FlyFFVERSION15\NeuroSpace\AccountServer\dpsrvr.h(20) : error C2143: syntax error : missing ',' before '<'
dpdbsrvr.cpp
c:\FlyFFVERSION15\NeuroSpace\AccountServer\dpsrvr.h(20) : error C2143: syntax error : missing ',' before '<'
c:\FlyFFVERSION15\NeuroSpace\AccountServer\dpadbill.h(10) : error C2143: syntax error : missing ',' before '<'
c:\FlyFFVERSION15\NeuroSpace\AccountServer\dpdbsrvr.h(14) : error C2143: syntax error : missing ',' before '<'
DBManager.cpp
c:\FlyFFVERSION15\NeuroSpace\AccountServer\dpdbsrvr.h(14) : error C2143: syntax error : missing ',' before '<'
AccountServer.cpp
c:\FlyFFVERSION15\NeuroSpace\AccountServer\dpsrvr.h(20) : error C2143: syntax error : missing ',' before '<'
c:\FlyFFVERSION15\NeuroSpace\AccountServer\dpdbsrvr.h(14) : error C2143: syntax error : missing ',' before '<'
c:\FlyFFVERSION15\NeuroSpace\AccountServer\dpadbill.h(10) : error C2143: syntax error : missing ',' before '<'
AccountServer.cpp(579) : error C2653: 'CBuffer3' : is not a class or namespace name
AccountServer.cpp(579) : error C2065: 'm_pPool2' : undeclared identifier
AccountServer.cpp(579) : error C2653: 'CBuffer3' : is not a class or namespace name
AccountServer.cpp(579) : error C2541: 'delete' : cannot delete objects that are not pointers
AccountServer.cpp(579) : error C3861: 'm_pPool2': identifier not found, even with argument-dependent lookup
AccountServer.cpp(579) : error C2653: 'CBuffer3' : is not a class or namespace name
AccountServer.cpp(579) : error C3861: 'm_pPool2': identifier not found, even with argument-dependent lookup
account.cpp
c:\FlyFFVERSION15\NeuroSpace\AccountServer\dpsrvr.h(20) : error C2143: syntax error : missing ',' before '<'
c:\FlyFFVERSION15\NeuroSpace\AccountServer\dpdbsrvr.h(14) : error C2143: syntax error : missing ',' before '<'
Generating Code...

Build log was saved at "file://c:\FlyFFVERSION15\Output\AccountServer\Release\BuildLog.htm"
AccountServer - 77 error(s), 0 warning(s)


---------------------- Done ----------------------

    Rebuild All: 0 succeeded, 1 failed, 0 skipped
this is my error while compling account
 
can you help me about the include directories that i use in all?


add me on skype: normandale
 
Last edited:
Pfft.

I started up VC2003 and tried to compile and now it randomly gives me ..\lib.obj errors.

Never did that before. Anyone know whyz?

Edit:

What about the LANG_SUB_MAX, PARTSKILLEXP1_01 and SEASON_NONE/MAX/SPRING/WINTER etc errors (The undeclared identifier) :P
 
Last edited:
DatabaseServer error while compiling please help


DB Server:
Code:
C:\NeuroSpace\SRC\FlyFF v15 Source\_Common\Tax.cpp(30): error C2227: left of '->mapTaxDetail' must point to class/struct/union
C:\NeuroSpace\SRC\FlyFF v15 Source\_Common\Tax.cpp(29): error C2065: 'CONT_EAST' : undeclared identifier
C:\NeuroSpace\SRC\FlyFF v15 Source\_Common\Tax.cpp(30): error C2227: left of '->second' must point to class/struct/union
C:\NeuroSpace\SRC\FlyFF v15 Source\_Common\Tax.cpp(30): error C2228: left of '.insert' must have class/struct/union type
C:\NeuroSpace\SRC\FlyFF v15 Source\_Common\Tax.cpp(30): error C3861: 'CONT_EAST': identifier not found, even with argument-dependent lookup
C:\NeuroSpace\SRC\FlyFF v15 Source\_Common\Tax.cpp(31): error C2065: 'CONT_WEST' : undeclared identifier
C:\NeuroSpace\SRC\FlyFF v15 Source\_Common\Tax.cpp(32): error C2065: 'CONT_ALL' : undeclared identifier
C:\NeuroSpace\SRC\FlyFF v15 Source\_Common\Tax.cpp(33): error C2227: left of '->second' must point to class/struct/union
C:\NeuroSpace\SRC\FlyFF v15 Source\_Common\Tax.cpp(33): error C2227: left of '->mapTaxDetail' must point to class/struct/union
C:\NeuroSpace\SRC\FlyFF v15 Source\_Common\Tax.cpp(33): error C2228: left of '.insert' must have class/struct/union type
C:\NeuroSpace\SRC\FlyFF v15 Source\_Common\Tax.cpp(33): error C3861: 'CONT_ALL': identifier not found, even with argument-dependent lookup
C:\NeuroSpace\SRC\FlyFF v15 Source\_Common\Tax.cpp(242): error C3861: 'CONT_ALL': identifier not found, even with argument-dependent lookup
C:\NeuroSpace\SRC\FlyFF v15 Source\_Common\Tax.cpp(251): error C3861: 'CONT_ALL': identifier not found, even with argument-dependent lookup
C:\NeuroSpace\SRC\FlyFF v15 Source\_Common\Tax.cpp(296): error C3861: 'CONT_ALL': identifier not found, even with argument-dependent lookup
C:\NeuroSpace\SRC\FlyFF v15 Source\_Common\Tax.cpp(303): error C3861: 'CONT_ALL': identifier not found, even with argument-dependent lookup
C:\NeuroSpace\SRC\FlyFF v15 Source\_Common\Tax.cpp(348): error C3861: 'CONT_ALL': identifier not found, even with argument-dependent lookup
C:\NeuroSpace\SRC\FlyFF v15 Source\_Common\Tax.cpp(454): error C3861: 'CONT_ALL': identifier not found, even with argument-dependent lookup
C:\NeuroSpace\SRC\FlyFF v15 Source\_Common\Tax.cpp(613): error C3861: 'CONT_ALL': identifier not found, even with argument-dependent lookup
C:\NeuroSpace\SRC\FlyFF v15 Source\_Common\Tax.cpp(663): error C3861: 'CONT_ALL': identifier not found, even with argument-dependent lookup
C:\NeuroSpace\SRC\FlyFF v15 Source\_Common\Continent.cpp(303): error C2065: 'CONT_NODATA' : undeclared identifier
C:\NeuroSpace\SRC\FlyFF v15 Source\_Common\Continent.cpp(321): error C3861: 'CONT_NODATA': identifier not found, even with argument-dependent lookup
C:\NeuroSpace\SRC\FlyFF v15 Source\_Common\Continent.cpp(327): error C3861: 'CONT_NODATA': identifier not found, even with argument-dependent lookup
C:\NeuroSpace\SRC\FlyFF v15 Source\_Common\Continent.cpp(328): error C3861: 'CONT_NODATA': identifier not found, even with argument-dependent lookup
C:\NeuroSpace\SRC\FlyFF v15 Source\_Common\Continent.cpp(329): error C2065: 'CONT_EAST' : undeclared identifier
C:\NeuroSpace\SRC\FlyFF v15 Source\_Common\Continent.cpp(330): error C3861: 'CONT_EAST': identifier not found, even with argument-dependent lookup
C:\NeuroSpace\SRC\FlyFF v15 Source\_Common\Continent.cpp(331): error C2065: 'CONT_WEST' : undeclared identifier
C:\NeuroSpace\SRC\FlyFF v15 Source\_Common\Continent.cpp(332): error C3861: 'CONT_WEST': identifier not found, even with argument-dependent lookup
C:\NeuroSpace\SRC\FlyFF v15 Source\_Common\Continent.cpp(334): error C3861: 'CONT_NODATA': identifier not found, even with argument-dependent lookup
C:\NeuroSpace\SRC\FlyFF v15 Source\_Common\Continent.cpp(351): error C2065: 'CONT_FLARIS' : undeclared identifier
C:\NeuroSpace\SRC\FlyFF v15 Source\_Common\Continent.cpp(351): error C2051: case expression not constant
C:\NeuroSpace\SRC\FlyFF v15 Source\_Common\Continent.cpp(354): error C2065: 'CONT_SAINTMORNING' : undeclared identifier
C:\NeuroSpace\SRC\FlyFF v15 Source\_Common\Continent.cpp(354): error C2051: case expression not constant
C:\NeuroSpace\SRC\FlyFF v15 Source\_Common\Continent.cpp(357): error C2065: 'CONT_DARKON12' : undeclared identifier
C:\NeuroSpace\SRC\FlyFF v15 Source\_Common\Continent.cpp(357): error C2051: case expression not constant
C:\NeuroSpace\SRC\FlyFF v15 Source\_Common\Continent.cpp(360): error C2065: 'CONT_DARKON3' : undeclared identifier
C:\NeuroSpace\SRC\FlyFF v15 Source\_Common\Continent.cpp(360): error C2051: case expression not constant
C:\NeuroSpace\SRC\FlyFF v15 Source\_Common\Continent.cpp(363): error C2065: 'CONT_RICIS' : undeclared identifier
C:\NeuroSpace\SRC\FlyFF v15 Source\_Common\Continent.cpp(363): error C2051: case expression not constant
C:\NeuroSpace\SRC\FlyFF v15 Source\_Common\Continent.cpp(367): error C3861: 'CONT_EAST': identifier not found, even with argument-dependent lookup
C:\NeuroSpace\SRC\FlyFF v15 Source\_Common\Continent.cpp(367): error C2051: case expression not constant
C:\NeuroSpace\SRC\FlyFF v15 Source\_Common\Continent.cpp(370): error C3861: 'CONT_WEST': identifier not found, even with argument-dependent lookup
C:\NeuroSpace\SRC\FlyFF v15 Source\_Common\Continent.cpp(370): error C2051: case expression not constant
C:\NeuroSpace\SRC\FlyFF v15 Source\_Common\Continent.cpp(374): error C2065: 'CONT_ALL' : undeclared identifier
C:\NeuroSpace\SRC\FlyFF v15 Source\_Common\Continent.cpp(374): error C2051: case expression not constant
C:\NeuroSpace\SRC\FlyFF v15 Source\_Common\Continent.cpp(377): warning C4060: switch statement contains no 'case' or 'default' labels
C:\NeuroSpace\SRC\FlyFF v15 Source\_Common\Continent.cpp(441): error C3861: 'CONT_FLARIS': identifier not found, even with argument-dependent lookup
C:\NeuroSpace\SRC\FlyFF v15 Source\_Common\Continent.cpp(445): error C3861: 'CONT_SAINTMORNING': identifier not found, even with argument-dependent lookup
C:\NeuroSpace\SRC\FlyFF v15 Source\_Common\Continent.cpp(449): error C3861: 'CONT_RICIS': identifier not found, even with argument-dependent lookup
C:\NeuroSpace\SRC\FlyFF v15 Source\_Common\Continent.cpp(453): error C3861: 'CONT_DARKON12': identifier not found, even with argument-dependent lookup
C:\NeuroSpace\SRC\FlyFF v15 Source\_Common\Continent.cpp(458): error C3861: 'CONT_DARKON3': identifier not found, even with argument-dependent lookup
C:\NeuroSpace\SRC\FlyFF v15 Source\_Common\Continent.cpp(463): error C2065: 'CONT_HARMONIN' : undeclared identifier
C:\NeuroSpace\SRC\FlyFF v15 Source\_Common\Continent.cpp(466): error C3861: 'CONT_NODATA': identifier not found, even with argument-dependent lookup
 
wow, just curious, 30 pages of discussion on this source,
mostly help about compiling the source.
ok..now.. 87%+ is having problems compiling the source.
from that 87%, 98% its compiling the soruce without modifications.

anyone get my point?
 
Excuse me sir..

How to fix these errors?

i tried linking libraries but it wont work...

Code:
Neuz error LNK2019: unresolved external symbol "public: __thiscall CWndChattingBlockingList::CWndChattingBlockingList(void)" (??0CWndChattingBlockingList@@QAE@XZ) referenced in function "int __cdecl TextCmd_IgnoreList(class CScanner &)" (?TextCmd_IgnoreList@@YAHAAVCScanner@@@Z)
Neuz error LNK2019: unresolved external symbol "public: __thiscall CWndMailRequestingBox::CWndMailRequestingBox(void)" (??0CWndMailRequestingBox@@QAE@XZ) referenced in function "public: virtual void __thiscall CWndPost::OnInitialUpdate(void)" (?OnInitialUpdate@CWndPost@@UAEXXZ)
Neuz error LNK2019: unresolved external symbol "public: void __thiscall CWndChattingBlockingList::UpdateInformation(void)" (?UpdateInformation@CWndChattingBlockingList@@QAEXXZ) referenced in function "int __cdecl TextCmd_BlockUser(class CScanner &)" (?TextCmd_BlockUser@@YAHAAVCScanner@@@Z)
Neuz fatal error LNK1120: 3 unresolved externals

THanks!
 
Excuse me sir..

How to fix these errors?

i tried linking libraries but it wont work...

Code:
Neuz error LNK2019: unresolved external symbol "public: __thiscall CWndChattingBlockingList::CWndChattingBlockingList(void)" (??0CWndChattingBlockingList@@QAE@XZ) referenced in function "int __cdecl TextCmd_IgnoreList(class CScanner &)" (?TextCmd_IgnoreList@@YAHAAVCScanner@@@Z)
Neuz error LNK2019: unresolved external symbol "public: __thiscall CWndMailRequestingBox::CWndMailRequestingBox(void)" (??0CWndMailRequestingBox@@QAE@XZ) referenced in function "public: virtual void __thiscall CWndPost::OnInitialUpdate(void)" (?OnInitialUpdate@CWndPost@@UAEXXZ)
Neuz error LNK2019: unresolved external symbol "public: void __thiscall CWndChattingBlockingList::UpdateInformation(void)" (?UpdateInformation@CWndChattingBlockingList@@QAEXXZ) referenced in function "int __cdecl TextCmd_BlockUser(class CScanner &)" (?TextCmd_BlockUser@@YAHAAVCScanner@@@Z)
Neuz fatal error LNK1120: 3 unresolved externals

THanks!
Edited a line xD? it could be wnd thingy.h in client resource :P
 
People still having problems to compile that :O? Cant understand that =/

i downloaded it, editet the pathes used 1 Tip. And Finished all 8 Projects without any Errors on the 1st try.

So i ask you, do you guys for some reason use another Windows not from this planet?

And oh yeah why even bothering with the soruce when you cant even compile it an solve these errors for yourself? :O

Sorry if this sounds rude to some people but thats my oppinion.
 
Last edited:
does anyone else have this problem?
When i logout of the game it does not save the character data into the database (Character_STR).

and i get this error in the querylog.
also when i close the server and reopen it, every character reverts back to the beginning. I'm more than certain and have been told this has deliberatly been put inplace in the source, either in dbmanager or dbmanagersave.

Code:
query:{call CHARACTER_STR('U1','0000018','01','',?,?,?,?,?,?,?,?,?,?,?,?,?,?,?,?,?,?,?,?,?,?,?,?,?,?,?,?,?,?,?,?,?,?,?,?,?,?,?,?,?,?,?,?,?,?,?,?,?,?,?,?,?,?,?,?,?,?,?,?,?,?,?,?,?,?,?,?,?,?,?,?,?,?,?,?,?,?,?,?,?,?,?,?,?,?,      0,      0,      0,?,?,?,?,?,?,?,?,?,?,?,?,?,?,?,?,?)}
SQLSTATE:42000 error:[Microsoft][SQL Native Client][SQL Server]Error converting data type varchar to int.

If anyone has the solution it would be greatly appreciatted and i'd probably pay for the help

add me on msn or PM me here plz: [email protected]
 
Back