Can't compile under JAVA 7:
[INFO] Scanning for projects...
[INFO] Reactor build order:
[INFO] Unnamed - com.angelis:TeraCommon:jar:1.0.0
[INFO] Unnamed - com.angelis:TeraGame:jar:1.0.0
[INFO] TeraLogin
[INFO] Unnamed - com.angelis:TeraLauncher:jar:1.0.0
[INFO] Unnamed - com.angelis:TeraTools:jar:1.0.0
[INFO] Unnamed - com.angelis:TeraBuilderom:1.0.0
[INFO] ------------------------------------------------------------------------
[INFO] Building Unnamed - com.angelis:TeraCommon:jar:1.0.0
[INFO] task-segment: [clean, compile, package]
[INFO] ------------------------------------------------------------------------
[INFO] [clean:clean {execution: default-clean}]
[INFO] Deleting directory .\TeraCommon\target
[INFO] [resources:resources {execution: default-resources}]
[INFO] Using 'UTF-8' encoding to copy filtered resources.
[INFO] skip non existing resourceDirectory .\TeraCommon\src\main\resources
[INFO] [compiler:compile {execution: default-compile}]
[INFO] Compiling 76 source files to .\TeraCommon\target\classes
[INFO] ------------------------------------------------------------------------
[ERROR] BUILD FAILURE
[INFO] ------------------------------------------------------------------------
[INFO] Compilation failure
Failure executing javac, but could not parse the error:
javac: invalid target release: 1.8
Usage: javac <options> <source files>
use -help for a list of possible options
[INFO] ------------------------------------------------------------------------
[INFO] For more information, run Maven with the -e switch
[INFO] ------------------------------------------------------------------------
[INFO] Total time: 3 seconds
[INFO] Finished at: T:T:T
[INFO] Final Memory: 10M/25M
[INFO] ------------------------------------------------------------------------
[INFO] Scanning for projects...
[INFO] Reactor build order:
[INFO] Unnamed - com.angelis:TeraCommon:jar:1.0.0
[INFO] Unnamed - com.angelis:TeraGame:jar:1.0.0
[INFO] TeraLogin
[INFO] Unnamed - com.angelis:TeraLauncher:jar:1.0.0
[INFO] Unnamed - com.angelis:TeraTools:jar:1.0.0
[INFO] Unnamed - com.angelis:TeraBuilderom:1.0.0
[INFO] ------------------------------------------------------------------------
[INFO] Building Unnamed - com.angelis:TeraCommon:jar:1.0.0
[INFO] task-segment: [clean, compile, package]
[INFO] ------------------------------------------------------------------------
[INFO] [clean:clean {execution: default-clean}]
[INFO] Deleting directory .\TeraCommon\target
[INFO] [resources:resources {execution: default-resources}]
[INFO] Using 'UTF-8' encoding to copy filtered resources.
[INFO] skip non existing resourceDirectory .\TeraCommon\src\main\resources
[INFO] [compiler:compile {execution: default-compile}]
[INFO] Compiling 76 source files to .\TeraCommon\target\classes
[INFO] ------------------------------------------------------------------------
[ERROR] BUILD FAILURE
[INFO] ------------------------------------------------------------------------
[INFO] Compilation failure
Failure executing javac, but could not parse the error:
javac: invalid target release: 1.8
Usage: javac <options> <source files>
use -help for a list of possible options
[INFO] ------------------------------------------------------------------------
[INFO] For more information, run Maven with the -e switch
[INFO] ------------------------------------------------------------------------
[INFO] Total time: 10 seconds
[INFO] Finished at: T:T:T
[INFO] Final Memory: 10M/25M
[INFO] ------------------------------------------------------------------------

